{"text_format":"1","workbook":"xlsx","n_sheets":22,"sheets":["Main","Data","Lookup","Infographics","InfoGraph data","Analysis Charts","Analysis Tables","Questionnaire","Camp List","Mimu_Township","Stat_01","NFI_3Ws","HEALTH","SHELTER & NFIs","WASH","FOOD","LIVELIHOOD","EDUCATION","PROTECTION","MOVEMENT","Priority Needs","CCCMShelter"],"not_rendered":{"charts":52,"images":14,"macros":1,"external_links":10,"defined_names":673,"comments":0,"pivot_tables":2},"unopened":[],"bounds":{"document_bytes":16777216,"sheet_cells":100000,"rows_first":2000,"rows_last":500,"rows_between":2000,"halvings":0,"cell_chars":16384,"cell_head_chars":4096},"cells_cut":0,"cells_raw":0,"read":"whole","date_system":"1900"}

{"sheet":"Main","index":0,"n_rows":21,"n_cols":3,"rows_kept":21,"cut":false,"hidden":false,"merged":[[2,1,2,12],[20,1,20,12],[9,6,9,11],[11,6,11,11],[13,6,13,11],[15,6,15,11]]}
[]
[]
[]
[]
[null,null,"Please select: "]
[]
[]
[]
[]
[]
[]
[]
[]
[]
[]
[]
[]
[]
[]
[]
[null,"CAMP COORDINATION AND CAMP MANAGEMENT (CCCM)"]

{"sheet":"Data","index":1,"n_rows":189,"n_cols":181,"rows_kept":189,"cut":false,"hidden":false,"merged":[]}
["REC","Data Entry Date","Camp profiling responsible organization","Camp profiling responsible organization - Other","Type of interviewer","Type of interviewer - Other","Date of interview","Key informant","Key informant - Sex","Key informant - Name","Key informant - Contact Number","Key informant - Main position","Key informant 2","Key informant 2 - Sex","Key informant - Name","Key informant - Contact Number","State/Region","Township","Village Tract/Town","Village/Ward","Camp Name","Pcode","GPS Coordinates - Longitude","GPS Coordinates - Latitude","Type of location","Camp Establishment Date - Month","Camp Establishment Date - Year","Access to the camp, dry season - by foot","Access to the camp, dry season - By motorbike","Access to the camp, dry season - By car/ 4WD","Access to the camp, dry season - By water","Access to the camp, rainy season - by foot","Access to the camp, rainy season - By motorbike","Access to the camp, rainy season - By car/ 4WD","Access to the camp, rainy season - By water","Name of nearest town from the camp","Distance to nearest town - in miles","Distance to nearest town - in minutes"," Camp have a Management / Responsible Agency? Y/N","Name of Camp Management/Responsible Agency","Camp manager/responsible person name","Camp Manager - Phone #","Registration book/list of residents available","Frequency of registration book update - With each population change ","Frequency of registration book update - At least weekly","Frequency of registration book update - At least monthly","Frequency of registration book update - Less frequent than monthly  ","Frequency of registration book update - Never updated","Electronic copy of the registration - Yes, in camp","Electronic copy of the registration - Yes, in camp management/responsible agency","Electronic copy of the registration - No","Information collected in registration book/list - Date of birth","Information collected in registration book/list - Age","Information collected in registration book/list - Date of entry into camp","Population - 0 to 5 months (Male)","Population - 0 to 5 months (Female)","Population - 0 to 5 months (Total)","Population - 6 to 23 months (Male)","Population - 6 to 23 months (Female)","Population - 6 to 23 months (Total)","Population - 2 to 4 years (Male)","Population - 2 to 4 years (Female)","Population - 2 to 4 years (Total)","Population - 5 to 11 years (Male)","Population - 5 to 11 years (Female)","Population - 5 to 11 years (Total)","Population - 12 to 17 years (Male)","Population - 12 to 17 years (Female)","Population - 12 to 17 years (Total)","Population - 18 to 35 years (Male)","Population - 18 to 35 years (Female)","Population - 18 to 35 years (Total)","Population - 36 to 59 years  (Male)","Population - 36 to 59 years  (Female)","Population - 36 to 59 years  (Total)","Population - 60 years and above (Male)","Population - 60 years and above (Female)","Population - 60 years and above (Total)","Population - Total (Male)","Population - Total (Female)","Population - Total (Total)","Vulnerable Population - Physically Disabled (Male)","Vulnerable Population - Physically Disabled (Female)","Vulnerable Population - Physically Disabled (Total)","Vulnerable Population - Mentally Disabled (Male)","Vulnerable Population - Mentally Disabled (Female)","Vulnerable Population - Mentally Disabled (Total)","Vulnerable Population - Chronically ill (Male)","Vulnerable Population - Chronically ill (Female)","Vulnerable Population - Chronically ill (Total)","Vulnerable Population - Unaccompanied children (<18) (Male)","Vulnerable Population - Unaccompanied children (<18) (Female)","Vulnerable Population - Unaccompanied children (<18) (Total)","Vulnerable Population - Separated children (<18) (Male)","Vulnerable Population - Separated children (<18) (Female)","Vulnerable Population - Separated children (<18) (Total)","Vulnerable Population - Unaccompanied elders (>60) (Male)","Vulnerable Population - Unaccompanied elders (>60) (Female)","Vulnerable Population - Unaccompanied elders (>60) (Total)","Vulnerable Population - Single headed households (Male)","Vulnerable Population - Single headed households (Female)","Vulnerable Population - Single headed households (Total)","Vulnerable Population - Pregnant women","Vulnerable Population - Lactating women","Population - Births in last 6 months (Male)","Population - Births in last 6 months (Female)","Population - Births in last 6 months (Total)","Population - Deaths in last 6 months (Male)","Population - Deaths in last 6 months (Female)","Population - Deaths in last 6 months (Total)","Total number Households","Total number Individuals","Permanent arrivals in last 6 months - Households","Permanent arrivals in last 6 months - Persons","Permanent departures in last 6 months - Households","Permanent departures in last 6 months - Persons","Anonymous complaints mechanism? Y/N","Camp management committee currently in place? Y/N","Camp management committee members - IDP members (Male)","Camp management committee members - IDP members (Female)","Camp management committee members - Non-IDP members (Male)","Camp management committee members - Non-IDP members (Female)","Camp management committee members - Total (Male)","Camp management committee members - Total (Female","Number of Camp committee members who have received CCCM training","Camp Management Committee represented adequately by -Women","Camp Management Committee represented adequately by -Elderly","Camp Management Committee represented adequately by - Youth","Camp Management Committee represented adequately by - Ethnic Groups","Camp Management Committee represented adequately by - Religious Groups","Camp Management Committee represented adequately by - PWSN","Distance to in Miles to nearest - Regular market","Distance to in Miles to nearest - Drinking water source","Distance to in Miles to nearest - Health facility","Distance to in Miles to nearest - Pre-school/nursery","Distance to in Miles to nearest - Primary school","Distance to in Miles to nearest - Middle school","Distance to in Miles to nearest - High school","Main type of kitchen(s) for camp residents","Proper storage facility for food in the camp? Y/N","Main type of shelter for camp residents","Approximate proportion of households sharing shelter","Approximate proportion of households without shelter","Shelters usually have partitioned rooms for sleeping? Y/N","Main source of drinking water for camp residents","Daily amount of drinking water sufficient for all camp residents","Total number of functioning latrines (Men)","Total number of functioning latrines (Women)","Total number of functioning latrines (Mixed)","Separate bathing areas for men and women? Y/N","Where/how is camp waste generally being disposed of","Type of the nearest accessible functioning health facility for camp residents","Type of the nearest accessible functioning health facility for camp residents - Other","Staff regularly available  for camp residents - Doctors","Staff regularly available  for camp residents - Nurses","Staff regularly available  for camp residents - Midwives","Health services regularly available  for camp residents - Vaccination","Health services regularly available  for camp residents - Preventive health care","Health services regularly available  for camp residents - Pre&Post natal care","Health services regularly available  for camp residents - Reproductive health care","Health services regularly available  for camp residents - Reproductive health care ","Health services regularly available  for camp residents - Psychosocial support services ","Health services regularly available  for camp residents - Don’t know","Approximate proportion of FEMALE children attending school","Approximate proportion of MALE children attending school","CURRENTLY, What are the TWO MAIN livelihoods activities for MALE camp resident - No.1","CURRENTLY, What are the TWO MAIN livelihoods activities for MALE camp resident - No.2","BEFORE DISPLACEMENT, what were the TWO MAIN livelihoods activities for MALE camp residents - No 1","BEFORE DISPLACEMENT, what were the TWO MAIN livelihoods activities for MALE camp residents - No 2","CURRENTLY, What are the TWO MAIN livelihoods activities for FEMALE camp resident - No.1","CURRENTLY, What are the TWO MAIN livelihoods activities for FEMALE camp resident - No.2","BEFORE DISPLACEMENT, what were the TWO MAIN livelihoods activities for FEMALE camp residents - No 1","BEFORE DISPLACEMENT, what were the TWO MAIN livelihoods activities for FEMALE camp residents - No 2","Camp Managers Priority 1","Camp Managers Priority 2","Camp Managers Priority 3","Camp Residents Priority 1","Camp Residents Priority 2","Camp Residents Priority 3","3Ws-NFI","CCCShelter3Ws"]
["G010","31/7/2013","DRC",null,"Enumerator from camp profiling  responsible organization",null,"18/6/2013","Camp Manager","Male",null,null,"Committee Member",null,null,null,null,"Kachin","Myitkyina","Urban","Tat Kone","Tat Kone Baptist Church","MMR001CMP001",97.386718999999999,25.415482000000001,"Urban",6,2011,"Yes","Yes","Yes","No","Yes","Yes","Yes","No","Myitkyina",null,10,"Yes","KBC","Bawk Htoi Naw","09 -4702709 6","Yes","No","No","Yes","No","No","No","No","Yes","Yes","Yes","Yes",0,2,0,4,5,0,8,10,0,27,19,0,15,20,0,25,28,0,28,32,0,5,11,0,112,127,239,3,0,3,1,0,1,1,1,2,4,4,8,0,1,1,0,0,0,0,0,0,1,11,1,0,1,0,0,0,54,239,1,5,7,25,"Yes","Yes",11,5,2,0,13,5,2,"No","Yes","No","No","Yes","No",null,null,null,null,null,null,null,"Individual","Yes","Solid shelters","96-100%","0%","Yes","Well","No",0,4,0,"No","Identified waste dump outside camp","Clinic",null,"No","Yes","Yes","Yes","No","Yes","Yes","Yes","Yes","No","76-95%","96-100%","Mining","Other","Farming","Mining","Livestock","Handicrafts","Farming","Livestock","Well / water tank                          ","Complementary Food                                 ","Other","Hygiene kits                                         ","Latrines/toilets                                      ","Vocational training                       ","KBC, UNHCR","KBC, UNHCR"]
["G009","31/7/2013","DRC",null,"Enumerator from camp profiling  responsible organization",null,"17/6/2013","Camp Manager","Male",null,null,"Committee Member","Other","Female",null,null,"Kachin","Myitkyina","Urban","N Jang Dung","Njang Dung Baptist Church ","MMR001CMP002",97.394547000000003,25.422194000000001,"Urban",6,2011,"Yes","Yes","Yes","No","Yes","Yes","Yes","No","Myitkyina",2,20,"Yes","KBC","U Kham Aung","09 -400023005","Yes","No","No","No","Yes","No","Yes","No","No","Yes","Yes","Yes",1,0,0,4,3,0,6,13,0,25,27,0,12,16,0,28,27,0,16,38,0,9,14,0,101,138,239,0,0,0,0,0,0,2,0,2,0,0,0,0,0,0,0,2,2,0,3,3,0,10,1,0,1,0,1,1,58,239,2,4,2,8,"Yes","Yes",3,1,0,2,13,2,2,"No","Yes","No","Yes","Yes","No",null,null,null,null,null,null,null,"Communal","No","Solid shelters","96-100%","0%","Yes","Well","Yes",0,0,14,"No","Identified waste dump outside camp","Hospital",null,"No","Yes","Yes","No","Yes","Yes","Yes","No","No","No","96-100%","96-100%","Farming","Other","Manufacturing (non-food)","Other","Farming","Other","Trade (buying and selling)","Livestock","Other","Other","Cash/money assistance","Individual shelter/houses             ","Vocational training                       ","Firewood / fuel                                                                      ","KBC, UNHCR","KBC, UNHCR"]
["G011","31/7/2013","DRC",null,"Enumerator from camp profiling  responsible organization",null,"21/6/2013","Camp Manager","Male",null,null,"FBO/NGO Staff","Camp Manager","Male",null,null,"Kachin","Myitkyina","Urban","Tat Kone-Htoi San","Tat Kone Galile Baptist Church","MMR001CMP003",97.377662999999998,25.404752999999999,"Urban",7,2011,"Yes","Yes","Yes","No","Yes","Yes","Yes","No","Myitkyina",null,10,"Yes","KBC","U Htin San","09 -40153328, 09 -401537674","Yes","No","No","Yes","No","No","No","No","Yes","Yes","Yes","Yes",1,0,0,2,3,0,5,8,0,14,18,0,7,14,0,11,11,0,11,18,0,6,5,0,57,77,134,0,0,0,0,0,0,0,0,0,1,2,3,0,0,0,0,0,0,0,1,1,1,3,1,0,1,0,1,1,30,134,2,11,1,4,"Yes","Yes",2,1,2,1,4,6,1,"Yes","Yes","No","No","Yes","No",null,null,null,null,null,null,null,"Individual","No","Solid shelters","96-100%","0%","Yes","Borehole/hand pump","Yes",2,2,0,"Yes","Is getting burnt","Hospital",null,"No","No","Yes","No","Yes","Yes","No","No","Yes","No","96-100%","96-100%","Mining","Other","Farming",null,"None","None","Farming","Trade (buying and selling)","Cash/money assistance","Vocational training                       ","Transport to school                     ","School materials / supplies                                         ","Access to job opportunities        ","Other","KBC, UNHCR","KBC, UNHCR"]
["I010","31/7/2013","SHALOM",null,"CCCM Focal Point",null,"9/6/2013","Camp Manager","Male",null,null,"Committee Member",null,null,null,null,"Kachin","Myitkyina","Urban","Tatkone Emanuela","Tat Kone Emanuel Church","MMR001CMP004",97.379272,25.401074999999999,"Urban",8,2011,"Yes","Yes","Yes","No","Yes","Yes","Yes","No","Myitkyina",1,null,"Yes","SHLOM","U La Nan","09-47019391","Yes","No","No","Yes","No","No","Yes","No","No","No","Yes","Yes",1,0,1,4,1,5,2,3,5,6,4,10,3,1,4,11,4,15,9,7,16,0,5,5,36,25,61,0,0,0,0,0,0,1,1,2,0,0,0,0,0,0,0,0,0,1,0,1,1,1,1,0,1,0,0,0,14,61,1,7,1,7,"Yes","Yes",2,3,6,1,8,4,2,"Yes","Yes","Yes","Yes","Yes","No",0.5,null,1,null,0.5,0.5,1.5,"Individual","No","Solid shelters","less than 25%","less than 25%","Yes","Well","Yes",0,0,2,"No","Is getting burnt","Hospital",null,"No","No","No","No","No","No","No","Yes","No","No","96-100%","76-95%","Mining","Other","Farming","Other","Trade (buying and selling)","None","Livestock","Trade (buying and selling)","Medical staff (doctor, nurse, etc)","Medicines","Access to job opportunities        ","Bathing spaces                                      ","Vocational training                       ","Firewood / fuel                                                                      ","KMSS, UNHCR, DRC","UNHCR"]
["A013","31/7/2013","DRC",null,"Enumerator from camp profiling  responsible organization",null,"20/6/2013","Camp Manager","Male",null,null,"Committee Member","Other","Male",null,null,"Kachin","Myitkyina","Urban","Tat kone","Tat Kone San Pya Baptist Church","MMR001CMP005",97.382192000000003,25.404015000000001,"Urban",null,null,"No","No","No","No","No","No","No","No","Myitkyina",null,null,"Yes","KBC",null,null,"Yes","No","No","No","No","No","No","No","Yes","No","No","No",0,0,0,0,0,0,0,0,0,0,0,0,0,0,0,0,0,0,0,0,0,0,0,0,0,0,0,0,0,0,0,0,0,0,0,0,0,0,0,0,0,0,0,0,0,0,0,0,0,0,0,0,0,0,0,0,43,191,1,4,0,0,"Yes","Yes",9,19,5,1,14,20,1,"No","No","No","No","Yes","No",null,null,null,null,null,null,null,"Communal","Yes","Solid shelters","51-75%","25-50%",null,"Borehole/hand pump","Yes",2,3,0,"No","Is getting burnt","Hospital",null,"No","Yes","Yes","No","No","No","No","No","No","No","96-100%","96-100%","Farming","Other","Farming","Other","Trade (buying and selling)","None","Farming","Trade (buying and selling)","Bathing spaces                                      ","Bathing spaces                                      ","Cash/money assistance","Other","Vocational training                       ","Transport to school                     ","KBC, UNHCR","KBC, Shalom, UNHCR"]
["A017","31/7/2013","KBC",null,"CCCM Focal Point",null,"29/6/2013","Camp Manager","Male",null,null,"Religious Leader","Camp Resident","Male",null,null,"Kachin","Myitkyina","Urban","Si tar Pu","Shatapru Sut Ngai Tawng","MMR001CMP006",97.399628000000007,25.412313000000001,"Urban",8,2011,"Yes","Yes","Yes","Yes","Yes","Yes","Yes","Yes","Myitkyina",1,3,"Yes","U Zaw Dan","Rev. U Maji Bawk Lar","09-400029741","Yes","Yes","No","No","Yes","No","No","No","Yes","Yes","Yes","Yes",3,3,6,14,7,21,20,13,33,53,38,91,30,48,78,31,48,79,23,41,64,6,16,22,180,214,394,4,1,5,1,1,2,1,3,4,0,0,0,0,0,0,6,16,22,1,4,5,7,1,0,3,3,0,0,0,94,394,14,41,18,79,"Yes","Yes",2,0,16,1,18,1,2,"Yes","Yes","Yes","No","Yes","No",0.5,null,null,0.25,1,0.5,0.5,"Communal","yes","Solid shelters",null,null,null,"Borehole/hand pump","Yes",6,6,0,"Yes","Identified waste dump outside camp","Clinic",null,"No","yes","No","No","No","No","No","No","No","No","96-100%","96-100%","Livestock","None","Farming","Livestock","Trade (buying and selling)","Manufacturing (non-food)","Farming","Livestock","Vocational training                       ","Basic Food                                       ","Access to job opportunities        ","Individual shelter/houses             ","School materials / supplies                                         ","Firewood / fuel                                                                      ","UNHCR","KBC, UNHCR"]
["A011","30/7/2013","Shalom",null,"CCCM Focal Point",null,"4/7/2013","Camp Manager","Male",null,null,"Religious leader",null,null,null,null,"Kachin","Myitkyina","Urban","Si tar Pu","Shatapru Thida Aye Baptist Church","MMR001CMP007",97.418004999999994,25.423817,"Urban",1,2012,"Yes","Yes","Yes","Yes","Yes","Yes","Yes","Yes","Myitkyina",5,null,"Yes","Shalom","U Zaw Pan Latt","09-400030539","Yes","Yes","No","No","No","No","yes","No","No","Yes","Yes","yes",0,1,1,1,0,1,1,4,5,5,5,10,11,8,19,7,5,12,9,11,20,2,4,6,36,38,74,0,0,0,0,0,0,0,0,0,0,0,0,1,3,4,0,0,0,0,0,0,0,1,0,1,1,0,0,0,15,74,1,3,2,6,"yes","yes",1,1,3,1,4,2,1,"Yes","Yes","Yes","Yes","Yes","No",0.5,null,null,null,null,null,null,"Communal","yes","Community/religious building","less than 25%","0%","yes","Well","yes",0,0,0,"No","Common identified waste dump inside camp","Clinic",null,"No","yes","No","No","Yes","Yes","No","No","yes","No","96-100%","76-95%","Livestock","Other","Livestock","Farming","Livestock","Other","Livestock",null,"Basic Food                                       ","Cash/money assistance","Firewood / fuel                                                                      ","Access to job opportunities        ","Access to job opportunities        ","Basic Food                                       ","KBC, UNHCR, DRC"]
["I006","31/7/2013","DRC",null,"Enumerator from camp profiling  responsible organization",null,"17/6/2013","Camp Manager","Male",null,null,"Religious Leader",null,null,null,null,"Kachin","Myitkyina","Man Kin (Sinbo Sub-township)","Man Kin","Man Hkring Baptist Church","MMR001CMP008",97.418694000000002,25.428910999999999,"Urban",7,2011,"Yes","Yes","Yes","No","Yes","Yes","Yes","No","Myitkyina",4,15,"Yes","KBC","U Hkawng Htaw","09-400013281","Yes","No","No","Yes","No","No","Yes","No","No","Yes","Yes","Yes",2,2,4,3,1,4,27,22,49,36,50,86,35,31,66,32,54,86,3,20,23,32,44,76,170,224,394,0,0,0,0,0,0,0,1,1,0,3,3,1,1,2,0,0,0,0,3,3,8,5,2,0,2,1,1,2,93,394,7,31,1,6,"Yes","Yes",3,11,10,4,13,15,2,"No","No","No","No","Yes","No",null,null,null,null,0.125,null,null,"Communal","No","Solid shelters","76-95%","76-95%","Yes","Well","Yes",5,9,0,"No","Is getting burnt","Hospital",null,"Yes","Yes","Yes","No","Yes","Yes","Yes","Yes","Yes","No","96-100%","96-100%","Farming","Trade (buying and selling)","None","None","Manufacturing (non-food)","Other","Farming","Livestock","Cash/money assistance","Cash/money assistance","Vocational training                       ","Vocational training                       ","Access to job opportunities        ","Firewood / fuel                                                                      ","KBC, UNHCR","UNHCR"]
["A019","31/7/2013","KBC",null,null,null,"4/7/2011","Camp Manager","Male",null,null,"Religious Leader",null,null,null,null,"Kachin","Myitkyina","Urban","Shwe Zet","Shwe Zet Baptist Church","MMR001CMP009",97.419403000000003,25.440928,"Urban",7,2011,"Yes","Yes","Yes","Yes","Yes","Yes","Yes","Yes","Myitkyina",5,null,"Yes","KBC","U Aung Latt","09-400032735","Yes","No","No","Yes","No","No","No","No","Yes","Yes","Yes","Yes",1,0,1,9,2,11,19,25,44,23,34,57,38,53,91,35,50,85,20,40,60,15,20,35,160,224,384,1,1,2,0,0,0,1,0,1,2,0,2,0,0,0,0,0,0,0,1,1,6,13,0,0,0,0,1,1,79,384,0,0,3,12,"yes","yes",1,1,2,5,3,6,3,"No","No","No","No","No","No",null,null,null,null,null,null,null,"Communal","yes","Solid shelters",null,null,null,"Well","Yes",0,0,0,"Yes","Identified waste dump outside camp","Rural centre",null,"No","No","Yes","No","No","No","No","No","No","No","96-100%","96-100%","None","None","Farming","Other","None","None","Farming","Other","Complementary Food                                 ","Access to job opportunities        ","Cash/money assistance","Vocational training                       ","Individual shelter/houses             ","Blankets/Winter Clothing                                         ","KMSS, UNHCR","KBC, UNHCR"]
["F011","31/7/2013","KBC",null,"CCCM Focal Point",null,"13/6/2013","Camp Manager","Male",null,null,"Religious Leader",null,null,null,null,"Kachin","Myitkyina","Urban","Du Kahtawng ward (4)","Du Kahtawng Qtr. 4","MMR001CMP010",97.383056999999994,25.395994000000002,"Urban",6,2011,"Yes","Yes","Yes","No","Yes","Yes","Yes","No","Myitkyina",1,10,"Yes","KBC","U Su Eik Kham",null,"Yes","No","Yes","No","No","No","No","No","Yes","Yes","Yes","Yes",0,0,0,1,0,1,2,0,2,2,2,4,5,6,11,3,2,5,5,6,11,1,1,2,19,17,36,0,0,0,0,0,0,0,1,1,0,1,1,0,0,0,0,0,0,0,1,1,0,0,0,0,0,0,0,0,6,36,6,36,3,16,"No","No",0,0,0,0,0,0,0,"No","No","No","No","No","No",1,null,1,null,null,null,null,"Communal","Yes","Solid shelters","0%","0%","Yes","Borehole/hand pump","Yes",0,0,0,"No","Identified waste dump outside camp","Clinic",null,"Yes","Yes","Yes","Yes","Yes","Yes","Yes","Yes","No","No","less than 25%","less than 25%","Mining","None","Farming","Livestock","None","None","Farming","Livestock","Latrines/toilets                                      ","School materials / supplies                                         ","Well / water tank                          ","Bathing spaces                                      ","Cash/money assistance","Medicines","KBC, UNHCR","KBC, UNHCR"]
["F013","31/7/2013","KBC",null,"CCCM Focal Point",null,"13/6/2013","Camp Manager","Male",null,null,"Religious Leader",null,null,null,null,"Kachin","Myitkyina","Urban","Du Kahtawng Ward (5)","Du Kahtawng Qtr. 5","MMR001CMP011",97.381195000000005,25.396363999999998,"Urban",6,2011,"Yes","Yes","Yes","No","Yes","Yes","Yes","No","Myitkyina",1,15,"Yes","KBC","U Su Eik Kham",null,"Yes","No","No","Yes","No","No","No","No","Yes","Yes","Yes","Yes",0,0,0,0,1,1,1,0,1,5,2,7,3,3,6,1,1,2,3,4,7,2,3,5,15,14,29,0,0,0,0,0,0,1,0,1,0,0,0,0,0,0,0,0,0,2,1,3,0,1,0,0,0,0,0,0,8,29,8,29,0,0,"No","No",0,0,0,0,0,0,0,"No","No","No","No","No","No",null,null,null,null,null,null,null,"Communal","No","Solid shelters","0%","0%","Yes","Borehole/hand pump","Yes",1,1,0,"No","Identified waste dump outside camp","Clinic",null,"Yes","Yes","Yes","Yes","Yes","Yes","Yes","Yes","No","No","less than 25%","less than 25%","Other","None","Farming","Livestock","Other","None","Farming","Livestock","Bathing spaces                                      ","Cash/money assistance","Well / water tank                          ","Transport to school                     ","Partitions within shelters","Medicines","KBC, UNHCR","KBC, UNHCR"]
["F012","31/7/2013","KBC",null,"CCCM Focal Point",null,"13/6/2013","Camp Manager","Male",null,null,"Religious Leader",null,null,null,null,"Kachin","Myitkyina","Urban","Du Kahtawng ward (14)","Du Kahtawng Qtr. 14","MMR001CMP012",97.385101000000006,25.399795999999998,"Urban",6,2011,"Yes","Yes","Yes","No","Yes","Yes","Yes","No","Myitkyina",1,15,"Yes","KBC","U Su Eik Kham",null,"Yes","No","Yes","No","No","No","No","No","Yes","Yes","Yes","Yes",0,0,0,0,0,0,0,2,2,3,1,4,1,2,3,1,3,4,2,4,6,1,2,3,8,14,22,1,0,1,0,0,0,1,2,3,0,0,0,1,0,1,0,0,0,0,1,1,0,0,0,0,0,0,1,1,6,22,6,33,6,23,"No","No",0,0,0,0,0,0,0,"No","No","No","No","No","No",null,null,5,null,null,null,null,"Communal","Yes","Solid shelters","less than 25%","0%",null,"Borehole/hand pump","Yes",0,0,2,"No","Identified waste dump outside camp","Clinic",null,"Yes","Yes","Yes","Yes","Yes","Yes","Yes","Yes","Yes","No","25-50%","less than 25%","Other","None","Farming","Livestock","Other","None","Farming","Livestock","Cash/money assistance","Latrines/toilets                                      ","Medicines","School materials / supplies                                         ","Kitchen sets                                         ","Well / water tank                          ","KBC, UNHCR","KBC, UNHCR"]
["C012","30/7/2013","DRC",null,"Enumerator from camp profiling  responsible organization",null,"13/6/2013","Camp Manager","Male",null,null,"Committee Member","Other","Female",null,null,"Kachin","Myitkyina","Urban","Kyun Pin Tharr","Kyun Pin Thar Baptist Church","MMR001CMP013",97.405120999999994,25.365891000000001,"Urban",12,2011,"Yes","Yes","Yes","No","Yes","Yes","Yes","No","Myitkyina",null,10,"Yes","Camp Management Group","U Shan Lum","0949241883","Yes","Yes","No","No","No","No","No","Yes","No","Yes","Yes","Yes",0,0,0,0,0,0,5,3,8,6,6,12,9,5,14,6,8,14,4,6,10,5,10,15,35,38,73,2,2,4,0,0,0,0,0,0,0,0,0,0,0,0,1,1,2,2,7,9,2,0,0,0,0,0,1,1,20,73,0,0,0,0,"Yes","Yes",3,2,5,1,8,3,2,"No","Yes","No","No","Yes","No",null,null,null,null,null,null,null,"Communal","Yes","Solid shelters","96-100%",null,"Yes","Well","Yes",0,0,4,"No","Is getting burnt","Hospital",null,"No","Yes","Yes","No","Yes","Yes","Yes","Yes","No","No","96-100%","76-95%","Manufacturing (non-food)","Other","Farming","Livestock","Mining","Other","Farming","Livestock","Latrines/toilets                                      ","Other","Well / water tank                          ","Cash/money assistance","Bathing spaces                                      ","Medicines","KBC, UNHCR","KBC, UNHCR"]
["G006","30/7/2013","DRC",null,"Enumerator from camp profiling  responsible organization",null,"19/6/2013","Camp Manager","Male",null,null,"Committee Member",null,null,null,null,"Kachin","Myitkyina","Urban","Le Kone","Le Kone Ziun Baptist Church ","MMR001CMP014",97.408919999999995,25.355983999999999,"Urban",6,2011,"Yes","Yes","Yes","No","Yes","Yes","Yes","No","Myitkyina",2,15,"Yes","Le Kone Zeun Baptist","Kyan Bawn","09 -40159 5730","Yes","Yes","No","No","No","No","No","No","Yes","Yes","Yes","Yes",2,1,0,9,7,0,25,27,0,85,63,0,68,79,0,80,104,0,58,84,0,23,27,0,350,392,742,3,0,3,0,1,1,3,2,5,5,2,7,3,0,3,2,2,4,0,18,18,5,9,1,1,2,1,0,1,151,742,10,72,15,53,"Yes","Yes",0,2,9,0,9,2,1,"No","Yes","No","No","No","No",0.375,null,0.375,null,0.125,null,null,"Individual","Yes","Solid shelters","51-75%","25-50%","Yes","Borehole/hand pump","Yes",0,0,15,"Yes","Common identified waste dump inside camp","Clinic",null,"Yes","Yes","Yes","No","Yes","Yes","Yes","Yes","Yes","No","96-100%","96-100%","Trade (buying and selling)","Other","Farming","Other","Trade (buying and selling)","Manufacturing (non-food)","Farming","Manufacturing (non-food)","Complementary Food                                 ","Cash/money assistance","Firewood / fuel                                                                      ","Vocational training                       ","Medicines","Complementary Food                                 ","KBC, UNHCR","KBC, UNHCR"]
["G007","30/7/2013","DRC",null,"Enumerator from camp profiling  responsible organization",null,"19/6/2013","Camp Manager","Male",null,null,"Religious Leader","Camp Manager","Male",null,null,"Kachin","Myitkyina","Urban","Le Kone","Maliyang Baptist Church","MMR001CMP016",97.411606000000006,25.360475999999998,"Urban",8,2011,"Yes","Yes","Yes","No","Yes","Yes","Yes","No","Myitkyina",1.25,10,"Yes","Le Kone MaliYang Baptist","U Haung Lwan","09 -431879 68","Yes","Yes","No","No","No","No","No","No","Yes","Yes","Yes","Yes",0,0,0,4,5,0,10,9,0,29,23,0,30,29,0,48,41,0,27,41,0,14,11,0,162,159,321,0,3,3,2,0,2,4,1,5,3,3,6,0,0,0,2,1,3,0,3,3,1,5,0,0,0,0,0,0,75,321,3,12,5,19,"Yes","Yes",0,0,5,2,5,2,2,"Yes","Yes","Yes","No","Yes","No",1,null,2,null,null,null,null,"Communal","Yes","Solid shelters","51-75%","25-50%","Yes","Well","Yes",0,0,7,"No","Identified waste dump outside camp","Clinic",null,"Yes","Yes","Yes","No","Yes","Yes","Yes","No","Yes","No","96-100%","96-100%","Livestock","Other","Farming","Livestock","Trade (buying and selling)","Other","Farming","Trade (buying and selling)","School materials / supplies                                         ","Cash/money assistance","Firewood / fuel                                                                      ","Complementary Food                                 ","Bathing spaces                                      ","Hygiene kits                                         ","KBC, UNHCR","UNHCR"]
["A012","30/7/2013","SHALOM",null,"CCCM Focal Point",null,"4/7/2013","Camp Manager","Male",null,null,"Religious leader",null,null,null,null,"Kachin","Myitkyina","Urban","Myae Myint","Myay Myint Baptist Church","MMR001CMP017",97.376671999999999,25.387862999999999,"Urban",10,2011,"Yes","Yes","Yes","No","Yes","Yes","Yes","No","Myitkyina",2,null,"Yes","Shalom","U Gam Aung","09-440006280","Yes","Yes","No","No","No","No","Yes","No","No","Yes","Yes","yes",0,0,0,3,0,3,1,0,1,8,8,16,5,7,12,1,2,3,6,7,13,1,3,4,25,27,52,1,0,1,0,0,0,0,0,0,0,0,0,0,0,0,0,1,1,0,0,0,2,0,0,0,0,0,0,0,12,53,2,18,1,3,"yes","yes",1,2,4,2,5,4,1,"Yes","Yes","Yes","Yes","Yes","No",0.375,null,null,null,null,null,null,"Communal","yes","Community/religious building","76-95%","0%","No","Well","Yes",0,0,0,"No","Identified waste dump outside camp","Clinic",null,"No","yes","No","No","Yes","yes","No","yes","yes","No","96-100%","96-100%","Handicrafts","Other","Farming","Livestock","Livestock","Other","Farming","Livestock","Basic Food                                       ","Partitions within shelters","Firewood / fuel                                                                      ","Women NFIs (sanitary pads, underwear, etc.)","Cash/money assistance","Vocational training                       ","KBC, UNHCR, DRC"]
["H003","29/7/2013","KBSS/KMSS",null,"CCCM Focal Point",null,"14/6/2013","Camp Manager","Male",null,null,"Committee Member",null,null,null,null,"Kachin","Myitkyina","Urban","Jan Mai Kawng","Jan Mai Kawng Catholic Church","MMR001CMP019",97.373361000000003,25.403476999999999,"Urban",7,2011,"Yes","Yes","Yes","No","Yes","Yes","Yes","No","Myitkyina",1,null,"Yes","KMSS","Sa Yar U Ah lam Tu Ja","09-47012472","Yes","No","No","Yes","No","No","No","Yes","No","Yes","Yes","Yes",1,1,2,14,20,34,15,14,29,18,24,42,60,89,149,39,51,90,37,50,87,3,9,12,187,258,445,4,0,4,1,1,2,0,2,2,4,2,6,0,0,0,3,9,12,0,8,8,8,9,1,1,2,0,0,0,99,445,0,0,1,7,"No","Yes",6,6,4,4,10,10,2,"Yes","Yes","No","No","Yes","No",1,null,null,null,0.2,0.2,2,"Mixed","Yes","Solid shelters","96-100%","0%","Yes","Well","Yes",0,0,0,"No","Identified waste dump outside camp","Hospital",null,"No","No","Yes","No","No","No","No","No","No","No","96-100%","96-100%","Manufacturing (non-food)","Other","Farming","Trade (buying and selling)","Farming","Manufacturing (non-food)","Farming","Other","Basic Food                                       ","Basic Food                                       ",null,null,null,null,"KMSS, UNHCR","KMSS, UNHCR"]
["H006","29/7/2013","SHALOM",null,"CCCM Focal Point",null,"12/6/2013","Camp Manager","Male",null,null,"Religious Leader",null,null,null,null,"Kachin","Myitkyina","Maw Hpawng","Maw Hpawng","Maw Hpawng Hka Nan Baptist Church","MMR001CMP020",97.284729999999996,25.374020000000002,"Rural",10,2011,"Yes","Yes","Yes","No","Yes","Yes","Yes","No","Myitkyina",7,0.25,"Yes","Shalom","U Ngwa Lay","09-40003309","Yes","Yes","No","No","Yes","No","No","No","Yes","Yes","Yes","Yes",3,3,6,5,7,12,5,3,8,8,5,13,6,9,15,4,7,11,10,7,17,7,13,20,48,54,102,1,0,1,0,0,0,0,0,0,0,0,0,0,0,0,0,0,0,0,0,0,0,4,0,0,0,0,0,0,24,107,24,102,0,0,"No","Yes",3,1,1,0,4,1,1,"Yes","No","No","No","Yes","No",null,0.125,null,null,null,0.25,0.25,"Individual","No","Community/religious building","51-75%","51-75%","Yes","Well","Yes",0,0,2,"No","Common identified waste dump inside camp","Rural centre",null,"No","Yes","No","No","Yes","Yes","No","Yes","Yes","No","51-75%","less than 25%","Farming","Fishing","Farming","Livestock","Livestock","Trade (buying and selling)","Farming","Livestock","Basic Food                                       ","Individual shelter/houses             ","Individual shelter/houses             ","School materials / supplies                                         ","Firewood / fuel                                                                      ","Access to job opportunities        ","KBC, UNHCR, DRC","Shalom, UNHCR"]
["I007","31/7/2013","SHALOM",null,"CCCM Focal Point",null,"11/6/2013","Camp Manager","Male",null,null,"Religious Leader",null,null,null,null,"Kachin","Myitkyina","Maw Hpawng","Maw Hpawng","Maw Hpawng Lhaovo Baptist Church","MMR001CMP021",97.291079999999994,25.371179999999999,"Rural",10,2011,"Yes","Yes","Yes","No","Yes","Yes","Yes","No","Myitkyina",7,25,"Yes","KBC","U Gyung Dau","09-401537691","Yes","Yes","No","No","No","No","Yes","No","No","Yes","Yes","Yes",1,0,1,4,2,6,1,6,7,12,10,22,12,8,20,12,12,24,5,9,14,2,3,5,49,50,99,0,0,0,0,0,0,2,0,2,0,0,0,0,0,0,1,0,1,1,1,2,2,1,0,0,0,0,0,0,20,99,24,110,0,0,"Yes","Yes",3,6,1,0,4,6,1,"Yes","Yes","No","No","Yes","No",0.125,null,null,null,null,0.125,1,"Individual","Yes","Solid shelters",null,null,null,"Well","Yes",0,0,0,"No","Identified waste dump outside camp","Rural centre",null,"No","No","No","No","Yes","No","No","Yes","No","No","96-100%","96-100%","Trade (buying and selling)","Handicrafts","Farming","Livestock","Trade (buying and selling)","Livestock","Farming","Livestock","Basic Food                                       ","Firewood / fuel                                                                      ","Access to job opportunities        ","Cash/money assistance","Hygiene kits                                         ","Access to job opportunities        ","KBC, UNHCR, DRC","Shalom, UNHCR"]
["B012","31/7/2013","SHALOM",null,"Enumerator from camp profiling  responsible organization",null,"12/7/2013","Camp Manager","Male",null,null,"Committee Member",null,null,null,null,"Kachin","Myitkyina","Urban","Kachin Su Ward","Wun Tho Buddhist Monastery","MMR001CMP022",97.403407999999999,25.377545999999999,"Urban",4,2012,"Yes","Yes","Yes","No","Yes","Yes","Yes","No","Myitkyina",null,10,"Yes","Shalom","U Myint Then","09-33185282","Yes","No","Yes","No","No","No","No","Yes","No","Yes","Yes","Yes",1,0,1,1,3,4,3,6,9,14,18,32,14,19,33,15,17,32,12,10,22,1,1,2,61,74,135,0,1,1,1,0,1,1,1,2,0,0,0,0,0,0,0,0,0,0,2,2,1,5,1,0,1,2,0,2,24,135,24,135,0,0,"Yes","Yes",2,2,0,0,2,2,2,"Yes","Yes","No","Yes","Yes","No",null,null,null,null,null,null,null,"Individual","Yes","Solid shelters","0%",null,"Yes","Borehole/hand pump","No",0,0,6,"No","Common identified waste dump inside camp","Hospital",null,"No","Yes","Yes","No","Yes","No","Yes","No","No","No","25-50%","51-75%","Mining","Other","Livestock",null,"Mining","Other","Farming","Livestock","Firewood / fuel                                                                      ","Kitchen sets                                         ","School materials / supplies                                         ","Vocational training                       ","Transport to school                     ","Access to job opportunities        ","UNHCR, DRC","Shalom, UNHCR"]
["I011","31/7/2013","SHALOM",null,"CCCM Focal Point",null,"9/6/2013","Camp Manager","Male",null,null,"Committee Member",null,null,null,null,"Kachin","Myitkyina","Urban","Tatkone","Tat Kone COC Baptist / Tat Kone Htoi San","MMR001CMP023",97.388400000000004,25.40982,"Urban",4,2012,"Yes","Yes","Yes","No","Yes","Yes","Yes","No","Myitkyina",1,null,"Yes","SHLOM","U Sandawng Hpung Ram","09-36000564","Yes","Yes","No","No","No","No","No","No","Yes","No","Yes","Yes",2,2,4,9,2,11,13,14,27,25,24,49,19,14,33,50,49,99,40,30,70,14,13,27,172,148,320,0,3,3,0,0,0,1,2,3,0,0,0,0,0,0,1,3,4,0,8,8,5,5,0,0,0,0,0,0,68,320,29,86,0,0,"Yes","Yes",13,2,5,1,18,3,1,"Yes","Yes","Yes","Yes","Yes","No",1,null,1,0.25,0.125,1,1,"Individual","No","Solid shelters","25-50%","25-50%","Yes","Borehole/hand pump","Yes",4,7,0,"Yes","Common identified waste dump inside camp","Hospital",null,"No","No","No","No","Yes","No","No","No","No","No","76-95%","76-95%","Mining","Other","Farming","Livestock","Livestock","Handicrafts","Farming","Livestock","Transport to school                     ","Transport to school                     ","Access to job opportunities        ","Cash/money assistance","Individual shelter/houses             ","Medicines","KBC, UNHCR, DRC","Shalom, UNHCR"]
["H002","29/7/2013","KBSS/KMSS",null,"CCCM Focal Point",null,"7/6/2013","Camp Manager","Female",null,null,"Religious Leader","Camp Resident","Female",null,null,"Kachin","Myitkyina","Nam Koi","Nam Koi","Nan Kway St. John Catholic Church","MMR001CMP024",97.359380000000002,25.411770000000001,"Urban",1,2012,"No","Yes","No","Yes","No","Yes","No","Yes","Myitkyina",5,15,"Yes","KMSS/MKN","Daw Lu Taung","09-400035482","Yes","No","No","Yes","No","No","No","No","Yes","Yes","Yes","No",2,5,7,7,6,13,12,17,29,37,31,68,32,38,70,31,37,68,20,29,49,3,11,14,144,174,318,0,0,0,0,0,0,0,0,0,0,0,0,0,0,0,0,1,1,0,0,0,2,7,0,0,0,0,0,0,67,318,4,0,3,16,"Yes","Yes",3,6,1,1,4,7,0,"Yes","Yes","No","No","Yes","No",5,null,null,null,0.2,0.2,0.2,"Communal","Yes","Solid shelters","0%","0%","Yes","Borehole/hand pump","Yes",8,12,0,"Yes","Common identified waste dump inside camp","Hospital",null,"No","Yes","No","No","No","No","No","No","No","No","51-75%","25-50%","Manufacturing (non-food)","Other","Farming","Trade (buying and selling)","Trade (buying and selling)","Livestock","Farming","Trade (buying and selling)","Medical staff (doctor, nurse, etc)","School materials / supplies                                         ","School materials / supplies                                         ","Transport to school                     ","Complementary Food                                 ","Cash/money assistance","UNHCR","KMSS, DRC"]
["A015","31/7/2013","DRC",null,"Enumerator from camp profiling  responsible organization",null,"14/6/2013","Camp Manager","Male",null,null,"Committee Member","Other","Female",null,null,"Kachin","Waingmaw","Urban","Myo Ma No. (2) ","Qtr. 2 Myoma Baptist Church","MMR001CMP025",97.438271,25.351655000000001,"Urban",6,2011,"Yes","Yes","Yes","No","yes","Yes","Yes","No","Waingmaw",null,1,"Yes","Committee","U Tu Nan","09-450050101","Yes","Yes","No","No","No","No","Yes","No","No","No","Yes","Yes",0,2,2,2,5,7,17,6,23,40,28,68,39,43,82,42,42,84,35,52,87,5,15,20,180,193,373,2,0,2,0,1,1,3,2,5,1,2,3,3,3,6,1,4,5,1,4,5,2,5,0,1,1,1,0,1,83,373,5,15,41,175,"Yes","yes",0,7,4,2,4,9,2,"Yes","Yes"," ","No","No","No",null,null,null,null,null,null,null,"Individual","yes","Solid shelters","96-100%",null,"Yes","Borehole/hand pump","Yes",6,8,0,"No","Identified waste dump outside camp","Hospital",null,"Yes","yes","Yes","No","Yes","Yes","yes","Yes","Yes","No","96-100%","96-100%","Farming","Other","Farming","Trade (buying and selling)","Other","None","Other",null,"Other","Cash/money assistance","Access to job opportunities        ","Hygiene kits                                         ","Hygiene kits                                         ","Kitchen sets                                         ","UNHCR, World Vision","KBC, UNHCR"]
["I012","31/7/2013","SHALOM",null,"CCCM Focal Point",null,"21/6/2013","Camp Manager","Male",null,null,"Committee Member",null,null,null,null,"Kachin","Waingmaw","Urban","Qtr.4 ","Qtr. 4 Monestry (Thargaya Thayett Taw)","MMR001CMP026",97.432495000000003,25.350809000000002,"Urban",2,2012,"Yes","Yes","Yes","Yes","Yes","Yes","Yes","Yes","Waimaw",1,5,"Yes","SHLOM","U Thine Aung","09-400042796","Yes","Yes","No","No","No","No","No","No","Yes","Yes","Yes","yes",3,6,9,1,10,11,22,16,38,50,50,100,35,27,62,67,86,153,60,53,113,20,21,41,258,269,527,3,1,4,0,1,1,1,1,2,0,0,0,0,0,0,0,0,0,0,0,0,3,7,3,5,8,2,1,3,101,527,3,19,2,7,"No","Yes",8,3,2,0,10,3,1,"Yes","Yes","Yes","Yes","Yes","No",null,null,null,null,null,null,null,"Individual","No","Solid shelters",null,"0%","Yes",null,"Yes",0,0,18,"Yes","Is getting burnt","Hospital",null,"Yes","Yes","No","No","Yes","No","No","No","Yes","No","96-100%","96-100%","Farming","Mining","Mining","Handicrafts","Trade (buying and selling)","Handicrafts","Farming","Trade (buying and selling)",null,null,null,null,null,null,"UNHCR, World Vision, DRC","Shalom, UNHCR"]
["I015","31/7/2013","SHALOM",null,"Other",null,"21/6/2013","Camp Manager","Male",null,null,"Religious Leader",null,null,null,null,"Kachin","Waingmaw","Urban","Mading","Mading Baptist Church","MMR001CMP027",97.451965000000001,25.356632000000001,"Rural",5,2012,"Yes","Yes","Yes","No","Yes","Yes","Yes","No","Waimaw",null,10,"yes","SHLOM","U Naw Ja","09-400034935","Yes","Yes","No","No","No","No","No","No","Yes","Yes","Yes","No",0,1,1,2,1,3,5,5,10,10,15,25,12,10,22,9,14,23,13,12,25,3,4,7,54,62,116,3,1,4,0,0,0,2,1,3,0,0,0,2,3,5,0,0,0,0,4,4,2,2,0,0,0,0,0,0,23,116,0,2,0,0,"No","Yes",3,3,2,0,5,3,2,"Yes","No","No","No","No","No",null,null,null,null,null,null,null,"Individual","Yes","Solid shelters","96-100%","less than 25%","Yes","Well","Yes",2,2,0,"No","Common identified waste dump inside camp","Hospital",null,"No","No","No","No","No","No","No","No","No","No","96-100%","96-100%","Other","None","Other",null,"None","None","Farming","Other","Hygiene kits                                         ","Basic Food                                       ","Cash/money assistance","Kitchen sets                                         ","Vocational training                       ","Medicines","World Vision, DRC","Shalom, UNHCR"]
["G008","31/7/2013","SHALOM",null,"CCCM Focal Point",null,"23/6/2013","Camp Manager","Male",null,null,"Committee Member","Camp Resident","Male",null,null,"Kachin","Waingmaw","Urban","Hkat Cho","Hkat Cho ","MMR001CMP028",97.408302000000006,25.324567999999999,"Rural",6,2011,"Yes","Yes","Yes","Yes","Yes","Yes","Yes","Yes","WaingMaw",3,5,"Yes","Shalom","U Eik Mon","09 -400049 772","Yes","Yes","No","No","No","No","Yes","No","No","Yes","Yes","Yes",2,1,0,16,10,0,33,25,0,35,54,0,39,41,0,67,84,0,70,69,0,3,8,0,265,292,557,6,0,6,0,0,0,0,1,1,0,0,0,0,0,0,0,0,0,0,5,5,5,15,3,1,4,0,1,1,134,564,3,12,5,13,"No","Yes",4,4,1,0,5,4,1,"Yes","Yes","No","No","Yes","No",null,null,0.5,null,null,null,null,"Individual","Yes",null,null,null,"Yes","Well","Yes",0,0,4,"Yes","Common identified waste dump inside camp","Rural sub-centre",null,"No","Yes","No","No","Yes","Yes","No","No","Yes","No","96-100%","96-100%","Trade (buying and selling)","Mining","Farming","Trade (buying and selling)","Other","None","Trade (buying and selling)","Other",null,null,null,null,null,null,"UNHCR, World Vision, DRC","Shalom, UNHCR, DRC"]
["I004","30/7/2013","KBSS/KMSS",null,"CCCM Focal Point",null,"19/6/2013","Camp Manager","Male",null,null,"Religious Leader",null,null,null,null,"Kachin","Waingmaw","Mai Na","Mai Na","Maina Catholic Church (St. Joseph)","MMR001CMP029",97.438450000000003,25.415900000000001,null,6,2013,"Yes","Yes","Yes","No","No","No","No","No","Myitkyina",4,15,"Yes","KMSS","Nga Brang Aung","09-33109-5512","Yes","No","Yes","Yes","No","No","Yes","No","No","Yes","Yes","Yes",3,6,9,25,27,52,54,57,111,106,110,216,88,73,161,100,137,237,92,140,232,18,42,60,486,592,1078,2,15,17,0,0,0,0,6,6,3,9,12,0,0,0,0,0,0,10,1,11,15,41,3,9,12,3,0,3,243,1078,0,0,2,10,"yes","Yes",7,6,null,null,7,6,7,"Yes","No","No","Yes","Yes","No",1,null,7,null,1,1,7,"Individual","Yes","Solid shelters","96-100%","25-50%","Yes","Well","Yes",0,0,0,"Yes","Common identified waste dump inside camp","Clinic",null,"Yes","Yes","No","No","Yes","No","Yes","Yes","Yes","No","less than 25%","less than 25%","Farming","Other","Farming","Other","Trade (buying and selling)","Other","Farming","Livestock","Basic Food                                       ","School materials / supplies                                         ","Firewood / fuel                                                                      ","Transport to school                     ","School facilities","Vocational training                       ","KMSS, UNHCR, World Vision","KMSS, UNHCR, DRC"]
["I013","31/7/2013","SHALOM",null,"CCCM Focal Point",null,"4/7/2013","Camp Manager","Male",null,null,null,null,null,null,null,"Kachin","Waingmaw","Urban","Qtr.3","Qtr. 3 Mu-yin  Baptist Church","MMR001CMP030",97.437568999999996,25.346004000000001,null,6,2011,"Yes","Yes","Yes","No","Yes","Yes","Yes","No","Waimaw",0.125,5,"Yes","KBC","U Brang Nu","09-36000855","Yes","No","No","Yes","No","No","No","No","Yes","Yes","Yes","yes",1,0,1,2,1,3,7,0,7,13,10,23,16,19,35,12,19,31,14,15,29,4,9,13,69,73,142,0,0,0,0,0,0,2,0,2,0,0,0,2,6,8,0,2,2,1,6,7,1,4,1,0,1,0,0,0,29,142,2,10,0,0,"No","Yes",2,0,2,2,4,2,1,"Yes","Yes","No","No","Yes","No",0.25,null,0.25,0.25,1,1,1,"Communal","Yes","Solid shelters","51-75%","25-50%","Yes","Well","Yes",0,0,0,"No","Identified waste dump outside camp","Hospital",null,"No","No","No","No","Yes","No","No","No","No","No","96-100%","96-100%","Mining","Other","Farming","Trade (buying and selling)","Livestock","Other","Farming","Livestock","Firewood / fuel                                                                      ","Firewood / fuel                                                                      ","Transport to school                     ","Cash/money assistance",null,null,"UNHCR, World Vision, DRC","Shalom, UNHCR"]
["H001","29/7/2013","SHALOM",null,"CCCM Focal Point",null,"19/6/2013","Camp Resident","Female",null,null,"Committee Member","Camp Resident","Male",null,null,"Kachin","Waingmaw","Mai Na","Mai Na","Maina AG Church","MMR001CMP031",97.435233999999994,25.425276,"Rural",7,2013,"Yes","Yes","Yes","No","Yes","Yes","Yes","No","Myitkyina",6,15,"Yes","Shalom","Daw Ngwa Ma Thar","09-47052236","Yes","No","No","Yes","No","No","No","Yes","No","Yes","Yes","Yes",3,3,6,11,6,17,12,15,27,47,52,99,54,39,93,75,65,140,55,60,115,11,19,30,268,259,527,3,0,3,0,0,0,10,9,19,5,2,7,3,3,6,0,1,1,0,3,3,7,3,1,2,3,1,1,2,113,543,0,0,2,15,"Yes","Yes",2,5,1,0,3,5,0,"Yes","Yes","No","No","Yes","No",0.125,0.125,4,0.25,0.25,1,1.5,"Individual","No","Solid shelters","96-100%","51-75%","Yes","Well","Yes",5,7,0,"Yes","Is getting burnt","Hospital",null,"No","Yes","No","No","Yes","No","Yes","Yes","No","No","25-50%","25-50%","Mining","Other","Farming","Livestock","Trade (buying and selling)","Manufacturing (non-food)","Farming","Livestock","Basic Food                                       ","Medical staff (doctor, nurse, etc)","Partitions within shelters","School materials / supplies                                         ","Hygiene kits                                         ","Cash/money assistance","UNHCR, World Vision, DRC","Shalom, UNHCR"]
["I014","31/7/2013","SHALOM",null,"Other",null,"6/6/2013","Camp Manager","Male",null,null,null,null,null,null,null,"Kachin","Waingmaw","Urban","Qtr.2","Qtr. 2 Lhaovo Baptist Church","MMR001CMP032",97.441483000000005,25.354883999999998,"Urban",7,2011,"Yes","Yes","Yes","Yes","Yes","Yes","Yes","No","Myitkyina",null,20,"Yes","SHLOM","Rev.Zawng Hkawng","09-44000299","Yes","Yes","No","No","No","No","Yes","No","No","Yes","Yes","No",3,2,5,3,7,10,12,12,24,28,20,48,41,45,86,42,50,92,22,39,61,4,12,16,155,187,342,2,3,5,0,0,0,6,5,11,11,18,29,0,0,0,0,5,5,2,13,15,4,6,1,2,3,0,0,0,118,332,30,88,2,2,"No","Yes",4,6,4,1,8,7,2,"Yes","Yes","Yes","No","No","No",null,null,null,null,null,null,null,"Individual","Yes","Solid shelters","76-95%","25-50%","Yes","Well","Yes",5,6,0,"Yes","Identified waste dump outside camp","Hospital",null,"No","Yes","No","No","No","No","No","No","No","No","96-100%","96-100%","Handicrafts","Other","Farming","Livestock","Livestock","Handicrafts","Farming","Trade (buying and selling)","Basic Food                                       ","Firewood / fuel                                                                      ","Cash/money assistance","Cash/money assistance","Firewood / fuel                                                                      ","Basic Food                                       ","UNHCR, World Vision, DRC","Shalom, UNHCR, World Vision"]
["A018","31/7/2013","KBC",null,null,null,"11/7/2013","Camp Manager","Male",null,null,"Committee Member",null,null,null,null,"Kachin","Waingmaw","Urban",null,"Waingmaw Baptist Zonal Office","MMR001CMP036",97.438259000000002,25.355841999999999,"Rural",11,2011,"No","No","No","No","No","No","No","No","Waingmaw",0.25,15,"Yes","KBC","U Gyung Lum","09-400038862","Yes","No","No","Yes","No","No","No","No","Yes","Yes","Yes","Yes",0,0,0,0,0,0,0,0,0,3,1,4,46,56,102,17,28,45,0,0,0,0,0,0,66,85,151,0,0,0,0,0,0,0,0,0,0,0,0,0,0,0,0,0,0,0,0,0,0,0,0,0,0,0,0,0,0,151,0,0,null,null,"Yes","Yes",2,0,2,1,4,1,null,"No","Yes","Yes","No","Yes","No",0.125,null,null,null,0.125,0.125,0.125,"Communal","Yes","Solid shelters",null,null,null,"Well","Yes",0,0,0,"Yes","Common identified waste dump inside camp","Hospital",null,"No","No","No","No","No","No","No","No","No","Yes","51-75%","51-75%","Other","None","Other",null,"Other","Other","Other",null,"Firewood / fuel                                                                      ","Kitchen sets                                         ","School materials / supplies                                         ","Hygiene kits                                         ","Cash/money assistance","Well / water tank                          ","KBC, UNHCR, World Vision","KBC, UNHCR, World Vision"]
["I009","31/7/2013","SHALOM",null,"CCCM Focal Point",null,"4/7/2013","Camp Manager","Male",null,null,"Religious Leader",null,null,null,null,"Kachin","Waingmaw","Urban","Qtr.4 ","Thargaya Lisu Baptist Church","MMR001CMP037",97.427959999999999,25.33351,null,null,null,"Yes","Yes","Yes","No","Yes","Yes","Yes","No","Wimaw",5,20,"Yes","KBC","U Lamyata","09-73076645","Yes","No","No","Yes","No","No","Yes","No","No","No","Yes","No",12,3,15,5,8,13,16,12,28,34,32,66,31,24,55,40,31,71,26,29,55,9,11,20,173,150,323,3,0,3,1,0,1,1,1,2,1,0,1,2,3,5,1,0,1,1,4,5,3,2,0,0,0,0,0,0,74,323,0,0,1,12,"Yes","Yes",2,1,7,null,9,1,null,"Yes","Yes","No","No","Yes","No",1,null,0.5,0.01,0.01,0.01,1,"Individual","Yes","Solid shelters","51-75%","25-50%","Yes","Well","No",5,5,0,"Yes","Identified waste dump outside camp","Hospital",null,"No","No","No","No","Yes","No","No","No","No","No","76-95%","76-95%","Fishing","Other","Farming","Livestock","Livestock","Other","Farming","Livestock","Basic Food                                       ","Health facility / Clinic                                         ","Partitions within shelters","Vocational training                       ","Access to job opportunities        ","Cash/money assistance","UNHCR, DRC","Shalom, UNHCR, World Vision"]
["I008","31/7/2013","OTHER",null,"CCCM Focal Point",null,"23/6/2013","Camp Manager","Male",null,null,"Religious Leader",null,null,null,null,"Kachin","Waingmaw","Urban","Qtr.3","Waingmaw AG Church","MMR001CMP038",97.443702000000002,25.351241999999999,"Urban",11,2011,"Yes","Yes","Yes","Yes","Yes","Yes","Yes","Yes","Myitkyina",10,30,"No",null,"U Dau Lum","09-440225709","Yes","Yes","No","Yes","No","No","Yes","Yes","No","Yes","Yes","Yes",0,2,2,15,13,28,16,10,26,34,37,71,35,40,75,46,53,99,30,32,62,9,14,23,185,201,386,0,0,0,1,0,1,1,0,1,0,0,0,1,1,2,0,0,0,0,3,3,1,2,0,0,0,0,0,0,79,386,7,23,0,0,"No","Yes",2,2,4,1,6,3,2,"Yes","No","No","No","No","No",null,null,null,null,null,null,null,"Individual","Yes","Solid shelters","51-75%","25-50%",null,"Well","No",2,4,0,"Yes","Is getting burnt","Hospital",null,"No","Yes","No","No","No","No","No","No","No","No","96-100%","96-100%","Other","None","Farming","Livestock","Other","None","Farming","Livestock","Vocational training                       ","Cash/money assistance","Access to job opportunities        ","Firewood / fuel                                                                      ","Firewood / fuel                                                                      ","Vocational training                       ","UNHCR","Shalom, UNHCR, World Vision"]
["A016","31/7/2013","KBC",null,null,null,"11/7/2013","Camp Manager","Male",null,null,"Religious Leader","Camp Resident","Female",null,null,"Kachin","Waingmaw","Mai Na","Mai Na","Maina Lawang Baptist Church","MMR001CMP039",97.426297000000005,25.409566000000002,"Urban",12,2011,"Yes","Yes","Yes","No","Yes","Yes","Yes","No","Myitkyina",2,20,"Yes","KBC","U Lamung La Roi","09-400056210","Yes","Yes","No","No","No","No","Yes","No","No","Yes","Yes","No",0,1,1,1,2,3,12,2,14,15,15,30,26,15,41,20,18,38,14,27,41,8,15,23,96,95,191,0,0,0,0,1,1,2,1,3,0,0,0,0,0,0,1,1,2,1,5,6,2,3,0,0,0,0,0,0,47,183,3,7,1,3,"Yes","yes",2,2,1,0,3,2,0,"No","Yes","No","No","No","No",0.125,null,null,null,0.125,0.125,0.125,"Individual","yes","Solid shelters",null,null,null,"Well","Yes",0,0,8,"Yes","Is getting burnt","Rural centre",null,"No","Yes","No","No","No","No","No","No","No","No","51-75%","51-75%","Other","None","Farming","Trade (buying and selling)","Other","None","Farming","Trade (buying and selling)","Access to job opportunities        ","Medicines","School facilities","Hygiene kits                                         ","Vocational training                       ","Blankets/Winter Clothing                                         ","KBC, UNHCR","KBC, UNHCR, World Vision"]
["A014","31/7/2013","DRC",null,"Enumerator from camp profiling  responsible organization",null,"14/6/2013","Camp Manager","Male",null,null,"Committee Member","Camp Resident","Male",null,null,"Kachin","Waingmaw","Mai Na","Mai Na","Maina KBC (Bawng Ring)","MMR001CMP040",97.437434999999994,25.411413,"Rural",6,2012,"Yes","Yes","Yes","No","yes","Yes","Yes","No","Myitkyina",6,null,"Yes","Committee","U Naw Lar","09-400032846","Yes","No","No","Yes","No","No","Yes","No","No","Yes","Yes","Yes",5,8,13,28,32,60,87,92,179,169,165,334,164,146,310,206,233,439,158,204,362,53,90,143,870,970,1840,3,3,6,2,0,2,14,19,33,3,0,3,3,0,3,0,2,2,2,2,4,20,25,4,1,5,1,0,1,419,1840,0,0,22,47,"Yes","Yes",11,16,3,2,14,18,2,"No","Yes","No","Yes","Yes","No",null,null,null,null,null,null,null,"Individual","No","Solid shelters","96-100%","96-100%","Yes","Well","Yes",0,0,60,"No","Common identified waste dump inside camp","Hospital",null,"Yes","Yes","Yes","No","Yes","Yes","yes","No","Yes","No","76-95%","76-95%","Other","None","Farming","Handicrafts","Trade (buying and selling)","Other","Farming","Trade (buying and selling)","Firewood / fuel                                                                      ","Cash/money assistance","Communal building                      ","Vocational training                       ","School materials / supplies                                         ","Latrines/toilets                                      ","KBC, UNHCR","KBC, UNHCR"]
["B011","30/7/2013","SHALOM",null,"CCCM Focal Point",null,"7/6/2013","Camp Manager","Male",null,null,"Committee Member",null,null,null,null,"Kachin","Chipwi","Urban",null,"Chipwi KBC camp","MMR001CMP042",null,null,"Urban",12,2012,"Yes","Yes","Yes","No","Yes","Yes","No","No","Chipwi",0.5,30,"Yes","Shalom","U Yaw Na","09-47018639","Yes","No","No","Yes","No","No","No","Yes","No","Yes","Yes","Yes",3,9,12,11,5,16,26,17,43,60,46,106,42,44,86,36,50,86,27,49,76,5,22,27,210,242,452,3,0,3,0,1,1,0,4,4,0,0,0,1,2,3,0,5,5,0,6,6,6,15,0,3,3,2,0,2,103,452,103,452,0,0,"No","Yes",3,0,8,2,11,2,1,"Yes","No","No","No","No","No",0.5,null,0.5,null,null,null,null,"Individual","Yes","Solid shelters","0%","less than 25%","Yes","Rivers, springs, etc.","Yes",5,5,0,"No","Identified waste dump outside camp","Clinic",null,"No","Yes","No","No","No","No","No","No","No","No","51-75%","25-50%","Farming","Other","Farming","Livestock","Other","None","Farming","Livestock","Basic Food                                       ","Bathing spaces                                      ","Vocational training                       ","Vocational training                       ","Well / water tank                          ","Well / water tank                          ","UNHCR"]
["C009","30/7/2013","RANIR",null,"Enumerator from camp profiling  responsible organization",null,"23/6/2013","Camp Manager","Male",null,null,"Authority","Camp Resident","Male",null,null,"Kachin","Chipwi","Hpa Re (Pang War Sub-township)","Hpa Re Waw Jang","Hpare Hkyer - BP6","MMR001CMP043",null,null,"Forest/bush",5,2012,"Yes","Yes","Yes","No","Yes","Yes","Yes","No","Chipwi",28,90,"Yes","IDP and Refugee Relief Committee (IRRC)","U Hkawng Zawng","+86 1536849 2616","Yes","Yes","No","No","No","No","No","No","Yes","No","Yes","Yes",2,5,7,14,11,25,40,53,93,100,102,202,74,60,134,98,82,180,75,66,141,13,25,38,416,404,820,5,1,6,1,0,1,0,0,0,0,0,0,1,1,2,0,1,1,0,14,14,5,70,3,7,10,1,6,7,141,820,4,22,3,10,"No","Yes",2,0,5,0,7,0,1,"No"," ","Yes","No","No","No",28,null,null,null,null,47,47,"Individual","No","Solid shelters","96-100%","0%","No","Rivers, springs, etc.","Yes",0,0,72,"No","Dumped everywhere inside the camp","Clinic",null,"Yes","Yes","Yes","No","Yes","No","Yes","Yes","No","No","51-75%","96-100%","Other","None","Farming","Trade (buying and selling)","Other","None","Farming","Other","School materials / supplies                                         ","Cash/money assistance","Bathing spaces                                      ","Complementary Food                                 ","Communal building                      ","Other","UNHCR,KBC, DRC"]
["B001","30/7/2013","UNHCR",null,"CCCM Focal Point",null,"13/6/2013","Camp Manager","Male",null,null,"Religious Leader",null,null,null,null,"Kachin","Bhamo","Urban","East Nyung Pin Yart","Robert Church","MMR001CMP047",97.228769999999997,24.26502,"Urban",7,2011,"Yes","Yes","Yes","No","Yes","Yes","Yes","No","Bhamo",null,5,"Yes","KBC","Rev. U Lahpai Aung Mai","09-400027894","Yes","No","No","Yes","No","No","No","Yes","No","No","Yes","Yes",22,25,47,100,84,184,135,132,267,292,262,554,190,220,410,426,493,919,90,179,269,43,98,141,1298,1493,2791,3,3,6,1,0,1,4,3,7,15,17,32,0,0,0,0,1,1,3,10,13,8,68,5,7,12,4,2,6,550,2791,160,520,78,270,"Yes","Yes",3,2,4,3,7,5,1,"No","No","No","No","No","No",null,null,null,null,null,null,null,"Individual","No","Solid shelters","less than 25%","0%","Yes","Borehole/hand pump","Yes",0,0,84,"No","Identified waste dump outside camp","Hospital",null,"Yes","Yes","No","No","Yes","Yes","Yes","No","Yes","No","96-100%","96-100%","None","None","Farming","Livestock","Livestock","Manufacturing (non-food)","Farming","Livestock","Transport to school                     ","Firewood / fuel                                                                      ","Cash/money assistance","Transport to school                     ","Medicines","Access to job opportunities        ","KBC, UNHCR","Shalom, UNHCR, DRC"]
["C003","30/7/2013","UNHCR",null,"CCCM Focal Point",null,"14/6/2013","Camp Manager","Female",null,null,"Religious Leader",null,null,null,null,"Kachin","Bhamo","Moe Hping","Thar Si","Lisu Boarding-House","MMR001CMP049",97.241630000000001,24.266110000000001,"Urban",6,2011,"Yes","Yes","Yes","No","Yes","Yes","Yes","No","Bhamo",2,15,"Yes","LBC","Daw Wor Sar Mi","09-400048602","Yes","No","No","Yes","No","No","No","No","Yes","Yes","Yes","Yes",3,0,3,6,11,17,14,9,23,53,30,83,43,20,63,39,29,68,22,20,42,0,4,4,180,123,303,0,0,0,0,1,1,0,0,0,0,0,0,20,11,31,0,0,0,1,9,10,4,7,1,0,1,0,0,0,60,303,22,112,1,2,"No","Yes",5,13,1,6,6,19,0,"Yes","Yes","Yes","No","Yes","No",0.375,null,1.5,0.625,1,1.625,2,"Individual","No","Solid shelters","less than 25%","76-95%","Yes","Well","Yes",0,0,8,"No","Common identified waste dump inside camp","Hospital",null,"No","No","No","No","Yes","Yes","No","No","Yes","No","96-100%","96-100%","None","Other","Farming","Livestock","Livestock","None","Farming","Livestock","Individual shelter/houses             ","Cash/money assistance","Other","Firewood / fuel                                                                      ","Kitchen sets                                         ","Access to job opportunities        ","UNHCR","UNHCR"]
["A003","30/7/2013","UNHCR",null,"CCCM Focal Point",null,"20/6/2013","Camp Manager","Male",null,null,"Religious Leader","Camp Resident","Female",null,null,"Kachin","Bhamo","Moe Hping","Thar Si","AD-2000 Tharthana Compound","MMR001CMP050",97.238829999999993,24.260719999999999,"Urban",11,2011,"Yes","Yes","Yes","No","Yes","Yes","Yes","No","Bhamo",null,5,"Yes","KMSS","U Lazing Aung","09-400035851","Yes","No","No","No","No","No","Yes","No","No","Yes","Yes","Yes",15,10,25,20,25,45,30,35,65,30,60,90,20,25,45,150,150,300,200,160,360,70,80,150,535,545,1080,6,4,10,2,0,2,0,1,1,0,0,0,5,3,8,0,3,3,1,1,2,3,80,0,0,0,0,0,0,174,1080,0,0,null,null,"No","Yes",8,6,0,0,8,6,2,"Yes","Yes","No","Yes","Yes","No",null,null,null,null,null,null,null,"Individual","Yes","Solid shelters","96-100%","96-100%","Yes","Well","Yes",0,0,0,"yes","Identified waste dump outside camp","Rural centre",null,"No","Yes","No","No","Yes","Yes","No","No","Yes","No","96-100%","96-100%","Farming","Handicrafts","Livestock","Trade (buying and selling)","Farming","Livestock","Farming","Livestock","Cash/money assistance","Firewood / fuel                                                                      ","Transport to school                     ","Access to job opportunities        ","Complementary Food                                 ","Women NFIs (sanitary pads, underwear, etc.)","KBSS, UNHCR","KBSS, UNHCR"]
["H005","29/7/2013","KBSS/KMSS",null,"CCCM Focal Point",null,"12/6/2013","Camp Manager","Male",null,null,"Committee Member","Camp Resident","Female",null,null,"Kachin","Bhamo","Urban","Pawk Kone","Mu-yin Baptist Church","MMR001CMP051",97.234200000000001,24.253067000000001,"Urban",10,2012,"Yes","Yes","Yes","Yes","No","Yes","No","No","Bhamo",1,5,"Yes","KBC","U Kha Aung",7450839,"Yes","No","No","No","No","No","Yes","No","No","Yes","Yes","Yes",0,0,0,0,0,0,0,0,0,0,1,1,0,0,0,0,0,0,0,1,1,1,0,1,1,2,3,0,0,0,0,0,0,0,0,0,0,0,0,0,0,0,0,0,0,0,0,0,0,0,0,0,0,0,0,0,1,3,0,0,3,null,"No","Yes",1,0,5,0,6,0,1,"Yes","No","No","No","No","No",null,null,null,null,null,null,null,"Mixed","No","Community/religious building","less than 25%","0%","No","Well","Yes",2,2,0,"Yes","Common identified waste dump inside camp","Hospital",null,"No","No","No","No","No","No","No","No","No","No","0%","0%","Livestock","None","None","Farming","Livestock","Livestock","None","Farming","Firewood / fuel                                                                      ","Basic Food                                       ","Firewood / fuel                                                                      ","Complementary Food                                 ","Latrines/toilets                                      ","Medicines"]
["B004","30/7/2013","UNHCR",null,"CCCM Focal Point",null,"13/6/2013","Camp Manager","Male",null,null,"Committee Member",null,null,null,null,"Kachin","Bhamo","Urban","Paung Kone Ward","Htoi San Church","MMR001CMP052",97.236919999999998,24.24766,"Urban",12,2011,"Yes","Yes","Yes","No","Yes","Yes","Yes","No","Bhamo",0.125,4,"No",null,"U Hpaw Mi Brang Shaung","074-50550","Yes","No","No","Yes","No","No","No","Yes","No","Yes","Yes","Yes",1,3,4,4,9,13,10,12,22,18,31,49,13,22,35,22,26,48,18,20,38,2,2,4,88,125,213,0,0,0,0,0,0,0,1,1,1,1,2,2,10,12,3,2,5,0,1,1,2,12,2,2,4,0,0,0,0,213,0,0,null,null,"No","Yes",3,2,0,0,3,2,0,"No","No","No","No","No","No",null,null,null,null,0.25,0.25,0.25,"Individual","Yes","Solid shelters","96-100%","0%","Yes","Borehole/hand pump","Yes",0,0,10,"No","Identified waste dump outside camp","Clinic",null,"Yes","Yes","No","Yes","Yes","Yes","Yes","No","No","No","76-95%","76-95%","Farming","Livestock","Farming","Livestock","Farming","Livestock","Farming","Livestock","School materials / supplies                                         ","Cash/money assistance","Firewood / fuel                                                                      ","Complementary Food                                 ","Medicines","Access to job opportunities        "]
["C002","30/7/2013","UNHCR",null,"CCCM Focal Point",null,"14/6/2013","Camp Manager","Male",null,null,"Committee Member",null,null,null,null,"Kachin","Bhamo","Han Te","Yoe Gyi","Yoe Kyi Monastery","MMR001CMP053",97.240639999999999,24.24953,"Urban",8,2012,"No","Yes","Yes","Yes","No","Yes","Yes","Yes","Bhamo",0.125,5,"Yes","Shalom","U Aye Lwin","09-47017734","Yes","No","No","Yes","No","No","No","No","Yes","No","Yes","Yes",1,0,1,4,2,6,4,3,7,10,6,16,18,8,26,13,15,28,9,6,15,4,5,9,63,45,108,0,0,0,0,0,0,1,0,1,3,0,3,0,0,0,1,1,2,0,2,2,1,2,0,0,0,0,0,0,31,108,0,0,0,0,"No","Yes",0,3,1,1,1,4,0,"Yes","No","No","No","No","No",3,null,null,null,4,null,null,"Communal","Yes","Solid shelters","0%","0%","Yes","Borehole/hand pump","Yes",0,0,8,"Yes","Is getting burnt","Hospital",null,"No","Yes","No","No","No","No","No","No","No","No","less than 25%","less than 25%","Livestock","Trade (buying and selling)","Farming","Livestock","Livestock","Manufacturing (food processing)","Trade (buying and selling)",null,"Basic Food                                       ","Complementary Food                                 ","Firewood / fuel                                                                      ","Health facility / Clinic                                         ","Well / water tank                          ","Cash/money assistance","UNHCR"]
["E003","30/7/2013","UNHCR",null,"CCCM Focal Point",null,"12/6/2013","Camp Manager","Male",null,null,"Committee Member",null,null,null,null,"Kachin","Bhamo","Nam Hlaing","Nam Hlaing","Nant Hlaing Church","MMR001CMP054",97.315860000000001,24.32638,"Urban",11,2011,"No","Yes","Yes","No","No","Yes","Yes","No","Bhamo",10,90,"Yes","KMSS BHAMO","Aye Mon",6881266,"Yes","No","No","Yes","No","No","Yes","No","No","Yes","Yes","yes",2,0,2,0,0,0,9,8,17,13,15,28,6,4,10,13,11,24,10,13,23,5,6,11,58,57,115,0,0,0,0,0,0,0,0,0,0,0,0,0,0,0,0,0,0,0,0,0,0,0,4,0,4,0,0,0,22,117,0,0,null,null,"No","Yes",2,3,5,1,7,4,1,"Yes","No","No","No","No","No",null,null,null,null,null,null,null,"Individual","No",null,"less than 25%","0%","Yes","Borehole/hand pump","Yes",8,8,0,"Yes","Is getting burnt","Hospital",null,"No","No","Yes","No","Yes","Yes","Yes","Yes","Yes","No","0%","0%","Livestock","Handicrafts","Farming","Handicrafts","Livestock","Trade (buying and selling)","Manufacturing (food processing)","Trade (buying and selling)","Complementary Food                                 ","Complementary Food                                 ","Transport to school                     ","Transport to school                     ","Vocational training                       ","Vocational training                       ","UNHCR","UNHCR"]
["A005","30/7/2013","UNHCR",null,"CCCM Focal Point",null,"15/6/2013","Camp Manager","Male",null,null,"Committee Member",null,null,null,null,"Kachin","Bhamo","Shwe Kyee Nar","Shwe Kyee Nar","Ta Gun Taing Monastery (Shwe Kyi Na)","MMR001CMP055",97.227789999999999,24.29138,"Urban",5,2012,"Yes","Yes","Yes","No","Yes","Yes","Yes","No","Bhamo",2,20,"Yes","KBSS","U Kham si",null,"Yes","Yes","No","No","No","No","No","No","Yes","Yes","Yes","Yes",3,0,3,7,6,13,6,10,16,35,32,67,28,19,47,37,36,73,31,37,68,4,16,20,151,156,307,0,2,2,1,2,3,0,2,2,4,3,7,2,2,4,0,3,3,0,6,6,2,3,5,0,5,0,0,0,69,307,0,0,0,0,"No","Yes",4,0,0,0,4,0,2,"Yes","Yes","No","No","No","No",0.375,null,null,null,0.25,"1 mile","1 mile","Individual","Yes","Solid shelters","96-100%","96-100%","Yes","Borehole/hand pump","Yes",8,9,0,"yes","Common identified waste dump inside camp","Hospital",null,"No","No","No","No","No","No","No","No","No","Yes","96-100%","96-100%","Farming","Mining","Farming","Livestock","None","None","Farming","Livestock","Cash/money assistance","Firewood / fuel                                                                      ","School materials / supplies                                         ","Blankets/Winter Clothing                                         ","Health facility / Clinic                                         ","Kitchen sets                                         ","UNHCR","UNHCR"]
["B002","30/7/2013","KBC",null,"CCCM Focal Point",null,"25/6/2013","Camp Manager","Male",null,null,"Religious Leader",null,null,null,null,"Kachin","Momauk","Urban","Alinn Koung Ward - 2","Momauk Baptist Church","MMR001CMP056",97.344359999999995,24.250689999999999,"Urban",6,2011,"Yes","Yes","Yes","No","Yes","Yes","Yes","No","Momauk",null,15,"Yes","KBC","U Seng Aung","09-33015569","Yes","No","No","Yes","No","No","No","Yes","No","Yes","Yes","Yes",24,13,37,98,87,185,53,46,99,159,139,298,89,110,199,112,205,317,114,213,327,35,63,98,684,876,1560,4,1,5,0,1,1,6,15,21,6,11,17,7,12,19,16,18,34,7,22,29,30,45,0,0,0,0,0,0,399,1555,0,0,0,0,"No","Yes",5,2,1,1,6,3,1,"No","No","No","No","No","No",null,null,null,null,1,1,1,"Individual","Yes","Solid shelters","0%","0%","Yes","Well","Yes",0,0,56,"Yes","Identified waste dump outside camp","Clinic",null,"No","No","No","No","Yes","Yes","Yes","Yes","No","No","0%","less than 25%","Trade (buying and selling)","Other","Farming","Other","Trade (buying and selling)","Other","Livestock","Other","Cash/money assistance","Firewood / fuel                                                                      ","Medicines","Access to job opportunities        ","Communal building                      ","Cash/money assistance","UNHCR","UNHCR"]
["H004","29/7/2013","KBSS/KMSS",null,"CCCM Focal Point",null,"23/6/2013","Camp Manager","Male",null,null,"FBO/NGO Staff",null,null,null,null,"Kachin","Momauk","Urban","Kye Nan","Momauk Catholic Church (St. Patrick)","MMR001CMP057",97.346950000000007,24.25177,"Urban",8,2011,"Yes","Yes","Yes","No","Yes","Yes","Yes","No","Momauk",null,3,"Yes","KMSS","U Ja Li/ U Tu Htan","745609 7","Yes","No","No","Yes","No","No","No","No","Yes","Yes","Yes","Yes",1,3,4,5,6,11,8,22,30,58,60,118,66,55,121,58,63,121,43,64,107,7,30,37,246,303,549,2,0,2,0,0,0,3,2,5,3,2,5,5,0,5,0,3,3,0,8,8,6,15,5,4,9,0,0,0,179,549,2,5,3,13,"No","Yes",4,4,2,0,6,4,1,"Yes","Yes","Yes","Yes","Yes","No",null,null,null,null,null,null,null,"Individual","Yes","Solid shelters","25-50%","0%","Yes","Well","Yes",9,14,2,"Yes","Identified waste dump outside camp","Clinic",null,"No","No","No","No","No","No","No","Yes","No","No","less than 25%","less than 25%","Trade (buying and selling)","Manufacturing (non-food)","Farming","Livestock","Livestock","Manufacturing (non-food)","Farming","Livestock","Complementary Food                                 ","Access to job opportunities        ","School materials / supplies                                         ","Cash/money assistance","Cash/money assistance",null,"UNHCR"]
["B003","30/7/2013","UNHCR",null,"CCCM Focal Point",null,"24/6/2013","Camp Manager","Male",null,null,"Committee Member","Camp Resident","Female",null,null,"Kachin","Momauk","Urban","Alinn Koung Ward","Mandalay Monestry","MMR001CMP058",97.346940000000004,24.251860000000001,"Urban",10,2011,"Yes","Yes","Yes","No","Yes","Yes","Yes","No","Momauk",0.125,2,"No",null,"U Sai Hpa",7456042,"Yes","No","Yes","No","No","No","No","No","Yes","Yes","Yes","Yes",0,0,0,0,0,0,2,1,3,1,3,4,2,0,2,1,2,3,4,3,7,1,2,3,11,11,22,0,0,0,0,0,0,0,0,0,0,0,0,0,0,0,0,0,0,0,0,0,0,1,0,0,0,0,0,0,6,22,0,0,2,3,"No","Yes",2,1,0,0,2,1,1,"No","No","No","No","No","No",null,null,null,null,null,null,null,"Individual","No","Solid shelters","less than 25%",null,"Yes","Well","Yes",4,1,0,"Yes","Is getting burnt","Hospital",null,"Yes","No","No","No","No","No","No","No","No","No","less than 25%","less than 25%","Manufacturing (non-food)","Other","Farming","Other","Trade (buying and selling)","Manufacturing (non-food)","Livestock","Other","Complementary Food                                 ","Complementary Food                                 ","Firewood / fuel                                                                      ","Firewood / fuel                                                                      ","Cash/money assistance","Cash/money assistance","UNHCR"]
["A004","30/7/2013","KBSS/KMSS",null,"CCCM Focal Point",null,"23/6/2013","Camp Manager","Male",null,null,"Committee Member","Camp Resident","Female",null,null,"Kachin","Momauk","Urban","Alinkawng","Ni Thaw Ka Monestry","MMR001CMP059",97.347740000000002,24.253769999999999,"Urban",10,2011,"Yes","Yes","Yes","No","Yes","Yes","Yes","No","Momauk",0.125,4,"Yes","Committee","Daw Kham Ko",6232282,"Yes","Yes","No","No","No","No","No","Yes","No","Yes","Yes","Yes",0,0,0,1,2,3,1,0,1,19,3,22,7,12,19,3,7,10,7,13,20,1,4,5,39,41,80,1,0,1,0,0,0,0,0,0,2,4,6,0,0,0,0,1,1,0,0,0,0,1,0,0,0,0,0,0,22,80,0,0,2,12,"No","Yes",1,4,0,0,1,4,1,"Yes","Yes","No","Yes","No","No",0.125,null,null,null,null,null,null,"Individual","No","Solid shelters","0%",null,"Yes","Well","Yes",2,2,0,"No","Common identified waste dump inside camp","Clinic",null,"No","Yes","No","No","No","No","No","No","No","No","less than 25%","less than 25%","Farming","Other","Farming","Other","Farming","Other","Farming","Other","Complementary Food                                 ",null,"Firewood / fuel                                                                      ",null,"Cash/money assistance",null,"UNHCR","UNHCR"]
["B005","30/7/2013","KBSS/KMSS",null,"CCCM Focal Point",null,"24/6/2013","Camp Manager","Male",null,null,"FBO/NGO Staff",null,null,null,null,"Kachin","Momauk","Man Pon","Man Pon","Man Bung Catholic compound","MMR001CMP062",97.325019999999995,24.245100000000001,"Urban",5,2012,"Yes","Yes","Yes","No","No","No","No","No","Momauk",0.5,30,null,"KBSS","U Lahpai Ja Li","074-56097","Yes","No","No","Yes","No","No","Yes","No","No","Yes","Yes","Yes",4,4,8,1,1,2,18,29,47,58,58,116,37,28,65,58,69,127,36,57,93,9,21,30,221,267,488,3,6,9,0,0,0,3,2,5,2,0,2,0,0,0,0,4,4,0,6,6,6,25,5,5,10,0,0,0,117,488,5,29,4,13,"No","Yes",1,5,0,0,1,5,1,"No","No","No","No","No","No",0.5,null,null,null,null,null,0.75,"Individual","Yes","Solid shelters","less than 25%","0%","Yes","Borehole/hand pump","No",6,8,0,"Yes","Common identified waste dump inside camp","Clinic",null,"No","No","No","No","No","No","No","Yes","No","No","less than 25%","less than 25%","Farming","Manufacturing (non-food)","Farming","Livestock","Livestock","Manufacturing (non-food)","Farming","Livestock","Cash/money assistance","Basic Food                                       ","Complementary Food                                 ","Firewood / fuel                                                                      ","Individual shelter/houses             ",null,"UNHCR","KBSS, UNHCR"]
["C001","30/7/2013","UNHCR",null,"CCCM Focal Point",null,"16/6/2013","Camp Manager","Male",null,null,"Committee Member","Camp Resident","Male",null,null,"Kachin","Mansi","Urban","Kaung Ra ","Mansi Baptist Church","MMR001CMP066",97.291820000000001,24.129059999999999,"Urban",11,2013,"No","No","No","No","No","No","No","No","Bhamo",12,60,"Yes","KBC","U Lahkang Tu","09-47023636","Yes","No","No","Yes","No","No","No","Yes","No","Yes","Yes","Yes",2,1,3,5,8,13,17,15,32,19,21,40,43,70,113,15,45,60,37,60,97,8,16,24,146,236,382,4,0,4,0,0,0,1,4,5,2,3,5,2,1,3,3,3,6,3,5,8,6,14,2,2,4,1,1,2,90,382,4,24,0,0,"No","Yes",0,1,5,3,5,4,1,"Yes","Yes","No","No","Yes","No",null,null,null,null,null,null,null,"Communal","No","Solid shelters","25-50%","0%","Yes","Well","Yes",0,0,0,"No","Common identified waste dump inside camp","Hospital",null,"Yes","Yes","No","No","Yes","Yes","No","Yes","Yes","No","0%","76-95%","Livestock","Other","Farming","Other","Livestock","Other","Farming","Other","Basic Food                                       ","Basic Food                                       ","Vocational training                       ","Kitchen sets                                         ","Individual shelter/houses             ","Women NFIs (sanitary pads, underwear, etc.)","KBSS, UNHCR","UNHCR"]
["A002","30/7/2013","UNHCR",null,"CCCM Focal Point",null,"20/6/2013","Camp Manager","Male",null,null,"Committee Member",null,null,null,null,"Kachin","Shwegu","Urban","No.(4) Bawgabala","Shwe Gu Baptist Church","MMR001CMP067",96.807353000000006,24.200361000000001,"Urban",7,2011,"Yes","Yes","Yes","No","Yes","Yes","Yes","Yes","Shwegu",null,20,"Yes","KBC","U maran Tu",7452343,"Yes","No","No","No","No","No","Yes","No","No","Yes","Yes","Yes",0,0,0,2,8,10,14,10,24,27,27,54,40,5,45,18,25,43,8,18,26,2,3,5,111,96,207,1,2,3,0,0,0,1,1,2,31,41,72,0,0,0,0,0,0,1,5,6,3,11,0,0,0,0,0,0,51,254,0,0,2,9,"No","Yes",0,0,7,2,7,2,0,"No","Yes","Yes","No","No","No",null,null,null,null,null,null,30,"Individual","No","Solid shelters","0%","25-50%","Yes","Well","No",3,5,4,"yes","Is getting burnt","Hospital",null,"Yes","Yes","No","No","Yes","Yes","No","Yes","Yes","No","25-50%","96-100%","Mining","Other","Farming","Livestock","Other","None","Trade (buying and selling)","Other","Basic Food                                       ","Complementary Food                                 ","Well / water tank                          ","Cash/money assistance","Access to job opportunities        ","Vocational training                       ","KBSS, UNHCR"]
["E002","30/7/2013","KBSS/KMSS",null,"CCCM Focal Point",null,"20/6/2013","Camp Manager","Male",null,null,"Religious Leader",null,null,null,null,"Kachin","Shwegu","Urban","Qtr.4 ","Shwe Gu Catholic Church","MMR001CMP068",96.807353000000006,24.200367,"Urban",7,2011,"Yes","Yes","Yes","Yes","Yes","Yes","Yes","Yes","Shwegu",null,null,"Yes","KMSS BHAMO","U Maran Seng","09-402592054","Yes","No","No","Yes","No","No","No","No","Yes","No","Yes","yes",0,0,0,6,6,12,10,10,20,12,18,30,18,24,42,13,30,43,10,13,23,1,3,4,70,104,174,1,1,2,0,0,0,0,0,0,18,20,38,1,0,1,0,0,0,0,1,1,3,6,0,0,0,0,1,1,47,174,0,0,null,null,"No","Yes",1,5,null,1,1,6,null,"Yes","No","No","No","No","No",null,null,null,null,null,null,null,"Mixed","Yes","Solid shelters","0%","0%","Yes","Borehole/hand pump","Yes",0,0,0,"Yes","Common identified waste dump inside camp","Clinic",null,"Yes","Yes","Yes","Yes","Yes","Yes","Yes","Yes","Yes","No","96-100%","96-100%","Mining","Other","Farming","Livestock","Other","None","Farming","Livestock","Firewood / fuel                                                                      ","Health facility / Clinic                                         ","Complementary Food                                 ","Medicines","Cash/money assistance","Hygiene kits                                         ","UNHCR","KBSS, UNHCR"]
["E009","30/7/2013","KBSS/KMSS",null,"CCCM Focal Point",null,"21/6/2013","Camp Manager","Male",null,null,"Committee Member",null,null,null,null,"Kachin","Momauk","Wein Hkam (Lwegel Sub-township)","Loi Je","Loi Je Catholic Church","MMR001CMP069",97.724566999999993,24.205417000000001,"Urban",11,2011,"Yes","yes","Yes","No","Yes","Yes","Yes","No","Loi Je",null,10,"Yes","FB ","U Toe Mai",13368827820,"Yes","No","No","Yes","No","No","No","No","Yes","Yes","Yes ","Yes",0,0,0,1,6,7,9,18,27,44,19,63,26,17,43,27,31,58,17,26,43,7,9,16,131,126,257,0,2,2,0,0,0,0,2,2,7,1,8,0,0,0,0,0,0,0,3,3,3,3,0,0,0,0,0,0,47,0,0,0,4,25,"No","Yes",9,4,null,null,null,null,1,"No","No","No","No","No","No",null,null,null,null,null,null,null,"Mixed","Yes","Solid shelters",null,null,"No","Borehole/hand pump","No",4,5,9,"No","Is getting burnt","Clinic","No","Yes","No","No","No","No","No","No","No","No","No","51-75%","51-75%","Other","None","Farming",null,"Other","None","Farming","Livestock","Complementary Food                                 ","Cash/money assistance","Latrines/toilets                                      ","Basic Food                                       ","Health facility / Clinic                                         ","Hygiene kits                                         ","UNHCR","KBSS, UNHCR"]
["C005","30/7/2013","UNHCR",null,"CCCM Focal Point",null,"20/6/2013","Camp Manager","Female",null,null,"Committee Member","Camp Resident","Female",null,null,"Kachin","Momauk","Wein Hkam (Lwegel Sub-township)","Aung Ze Yar","Loi Je Lisu Camp","MMR001CMP070",97.717133000000004,24.200433,"Urban",4,2012,"Yes","Yes","Yes","No","Yes","Yes","Yes","No","Loi Je",null,15,"Yes","Loi Je Lisu Camp","Daw Lu Di","+86 (0692) 6876578","Yes","Yes","No","No","No","No","No","No","Yes","Yes","Yes","No",0,0,0,9,16,25,31,34,65,78,70,148,56,51,107,81,81,162,47,68,115,13,17,30,315,337,652,4,0,4,1,0,1,4,4,8,0,1,1,1,0,1,13,17,30,2,15,17,5,15,0,0,0,0,4,4,131,652,10,44,0,0,"Yes","Yes",19,10,0,0,0,0,1,"Yes","Yes","No","No","Yes","No",null,null,null,null,null,null,null,"Mixed","No","Solid shelters","76-95%","76-95%","Yes","Well","No",10,10,0,"No","Identified waste dump outside camp","Clinic",null,"No","No","No","No","No","Yes","No","No","No","No","51-75%","51-75%","Other","None","Farming","Livestock","Other","None","Farming","Livestock","Complementary Food                                 ","Firewood / fuel                                                                      ","Well / water tank                          ","Communal building                      ","Bathing spaces                                      ","Cash/money assistance","UNHCR","UNHCR"]
["C004","30/7/2013","UNHCR",null,"CCCM Focal Point",null,"22/6/2013","Camp Manager","Female",null,null,"Committee Member",null,null,null,null,"Kachin","Momauk","Wein Hkam (Lwegel Sub-township)","Say Yone Kone","Nyaung Na Pin ","MMR001CMP072",97.724483000000006,24.205417000000001,"Urban",8,2012,"Yes","Yes","No","No","Yes","Yes","No","No","Loi Je",null,null,"Yes","Loi Je Baptist Church","U Naw San","+86 13320457325","Yes","Yes","No","No","No","No","No","No","Yes","Yes","Yes","No",3,0,3,3,4,7,11,8,19,27,32,59,25,27,52,29,18,47,26,31,57,6,11,17,130,131,261,2,2,4,0,1,1,3,0,3,0,0,0,0,0,0,0,0,0,2,2,4,2,4,0,0,0,0,0,0,47,261,0,0,null,null,"No","Yes",14,7,0,0,0,0,1,"Yes","Yes","No","Yes","Yes","No",null,null,null,null,null,null,null,"Individual","Yes",null,"less than 25%","96-100%","Yes","Well","Yes",0,0,0,"Yes","Identified waste dump outside camp","Clinic",null,"No","No","Yes","No","No","No","No","No","No","No","51-75%","25-50%","Other","None","Farming","Livestock","Other","None","Farming","Livestock","Basic Food                                       ","Basic Food                                       ","Kitchen sets                                         ","Women NFIs (sanitary pads, underwear, etc.)","Cash/money assistance","School facilities","UNHCR","UNHCR"]
["E001","30/7/2013","UNHCR",null,"CCCM Focal Point",null,"12/6/2013","Camp Manager","Male",null,null,"Committee Member",null,null,null,null,"Kachin","Momauk","Wein Hkam (Lwegel Sub-township)","Seng Ja ","Seng Ja ","MMR001CMP073",97.710864000000001,24.207332999999998,"Urban",8,2012,"Yes","Yes","Yes","No","Yes","Yes","Yes","No","Waingmaw",null,20,"Yes","KBC","U Lashi Tu Nan",13320457150,"Yes","No","No","Yes","No","No","No","yes","No","Yes","Yes","yes",1,0,1,3,4,7,6,12,18,19,22,41,22,15,37,21,18,39,18,23,41,2,9,11,92,103,195,0,0,0,0,1,1,1,0,1,0,0,0,0,3,3,0,0,0,0,1,1,1,4,1,1,2,1,0,1,35,195,4,29,2,11,"No","Yes",6,8,1,0,7,8,0,"Yes","No","No","No","No","No",null,null,null,null,null,null,null,"Individual","No","Solid shelters","0%","0%","Yes","Well","Yes",0,0,2,"Yes","Identified waste dump outside camp","Clinic",null,"No","No","No","No","Yes","Yes","Yes","Yes","No","No","0%","96-100%","Farming","Other","Farming","Livestock","Other","None","Farming","Livestock","Basic Food                                       ","Basic Food                                       ","Communal building                      ","Complementary Food                                 ","Cash/money assistance","Cash/money assistance","UNHCR","UNHCR"]
["B014","31/7/2013","UNHCR",null,"CCCM Focal Point",null,"24/6/2013","Camp Manager","Male",null,null,"Religious Leader",null,null,null,null,"Kachin","Mogaung","Nawng Kaing Htaw","Nawng Kaing Htaw","Mang Hawng Baptist Church","MMR001CMP077",96.942279999999997,25.296579999999999,"Urban",5,2012,"Yes","Yes","Yes","No","Yes","Yes","Yes","No","Mogaug",null,null,"Yes","Relife Committee","U Zaw Htoi Nan","09-400023943","Yes","Yes","No","No","No","No","No","Yes","No","Yes","Yes","Yes",0,0,0,3,2,5,7,6,13,10,4,14,4,7,11,0,6,6,0,1,1,0,0,0,24,26,50,0,0,0,0,0,0,0,1,1,2,0,2,0,0,0,0,0,0,0,6,6,1,4,0,0,0,1,3,4,14,60,1,4,2,6,"No","Yes",0,1,0,9,9,1,0,"No","No","No","No","No","Yes",0.5,null,0.5,null,0.5,0.5,0.5,"Individual","Yes","Solid shelters",null,null,null,"Borehole/hand pump","No",2,2,0,"No","Identified waste dump outside camp","Hospital",null,"No","No","Yes","No","No","No","No","No","No","No","96-100%","96-100%","Mining","Other","Farming","Livestock","Other","None","Farming","Livestock","School materials / supplies                                         ","Cash/money assistance","Medical staff (doctor, nurse, etc)","Hygiene kits                                         ","Access to job opportunities        ","Blankets/Winter Clothing                                         ","UNHCR","KBC, UNHCR"]
["B015","31/7/2013","UNHCR",null,"CCCM Focal Point",null,"24/6/2013","Camp Manager","Male",null,null,"Religious Leader",null,null,null,null,"Kachin","Mogaung","Urban","Kyuntaw","Kyun Taw Baptist Church ","MMR001CMP078",96.922619999999995,25.305669999999999,"Urban",5,2012,"Yes","Yes","Yes","No","Yes","Yes","Yes","No","Mogaug",null,null,"Yes","Relife Committee","U Zaw Tang","09-401537670","Yes","Yes","No","No","No","No","No","No","Yes","Yes","Yes","Yes",1,0,1,3,1,4,5,1,6,10,3,13,4,5,9,1,5,6,1,6,7,0,2,2,25,23,48,1,0,1,0,0,0,0,0,0,1,0,1,1,0,1,0,1,1,1,1,2,0,4,1,0,1,0,0,0,13,48,0,0,1,3,"No","Yes",0,0,12,5,12,5,0,"Yes","No","No","No","Yes","No",0.375,null,null,null,0.375,1,1,"Communal","Yes","Solid shelters","76-95%","0%","Yes","Borehole/hand pump","Yes",2,3,5,"No","Identified waste dump outside camp","Hospital",null,"No","No","No","Yes","No","No","No","No","No","Yes","96-100%","96-100%","Livestock","None","Farming","Livestock","None","None","Farming","Other","Firewood / fuel                                                                      ","Vocational training                       ","Complementary Food                                 ","Cash/money assistance","Well / water tank                          ","Hygiene kits                                         ","UNHCR","KBC, UNHCR"]
["E008","30/7/2013","UNHCR",null,"CCCM Focal Point",null,"24/6/2013","Camp Manager","Male",null,null,"Committee Member",null,null,null,null,"Kachin","Mogaung","Urban","Natkyi kone","Nat Gyi Kone Baptist Church ","MMR001CMP079",96.948740000000001,25.30442,"Urban",3,2012,"Yes","yes","Yes","No","Yes","Yes","Yes","No","Mogaung",null,null,"Yes","KBC","U Sai Khum","09-400035242","Yes","Yes","No","No","No","No","No","Yes","No","Yes","Yes ","Yes",0,0,0,2,0,2,2,1,3,8,4,12,1,3,4,2,5,7,2,6,8,2,2,4,19,21,40,1,0,1,0,0,0,0,0,0,0,0,0,0,0,0,0,0,0,0,0,0,2,2,0,1,1,0,1,1,12,40,1,1,4,17,"No","Yes",1,1,7,0,8,1,0,"No","No","No","No","No","No",null,null,null,null,"No",null,null,"Communal","Yes","Solid shelters","less than 25%","less than 25%","Yes","Well","Yes",0,0,3,"Yes","Is getting burnt","Hospital","No","No","Yes","No","No","No","No","No","No","No","No","96-100%","96-100%","Other","None","Farming",null,"Other","None","None","None","Medicines","Cash/money assistance","Firewood / fuel                                                                      ","Women NFIs (sanitary pads, underwear, etc.)","Access to job opportunities        ","Hygiene kits                                         ","UNHCR","KBC, UNHCR"]
["E007","30/7/2013","KBC",null,"Other","Other (name)","29/6/2013","Camp Manager","Male",null,null,"Religious Leader",null,null,null,null,"Kachin","Mohnyin","Nam Mun","Nam Mun","Nant Mun","MMR001CMP081",96.364949999999993,24.998349999999999,"Rural",3,2012,"Yes","Yes","Yes","No","Yes","Yes","Yes","No","Ho Pin",15,60,"Yes","KBC","Aung Mai","09-47035631","Yes","No","No","Yes","No","No","Yes","No","No","No","Yes ","Yes",0,0,0,1,0,0,5,7,12,20,10,30,8,12,20,4,9,13,7,11,18,2,1,3,47,50,97,1,1,2,0,0,0,0,1,1,2,1,3,0,1,1,1,1,2,0,3,3,2,1,0,0,0,0,0,0,21,97,21,97,2,8,"No","Yes",0,0,4,6,4,6,0,"No","No","No","No","No","No",null,1,1,null,"No",null,15,"Individual","No","Solid shelters","less than 25%","0%","Yes","Borehole/hand pump","Yes",0,0,3,"No","Identified waste dump outside camp","Rural sub-centre",null,"No","Yes","Yes","No","Yes","No","No","No","No","No","96-100%","96-100%","Trade (buying and selling)","None","Farming",null,"Other","None","Farming",null,"Medicines","Latrines/toilets                                      ","Vocational training                       ","Medicines","School facilities","Well / water tank                          "]
["D011","31/7/2013","KBC",null,"Other",null,"17/6/2013","Camp Manager","Male",null,null,"Committee Member","Camp Resident","Female",null,null,"Kachin","Hpakant","Urban","Ngapyawtaw","Nga Pyaw Taw Baptist Nursery School ","MMR001CMP082",96.312790000000007,25.611160000000002,"Urban",8,2012,"Yes","Yes","Yes","No","Yes","Yes","Yes","No","Hpakan",0,1,"Yes","Hpakan Baptist","Saya B Tu Jar","09-6413346","Yes","No","No","Yes","No","No","Yes","No","No","Yes","Yes","Yes",4,3,7,3,12,15,9,16,25,24,33,57,34,38,72,28,34,62,26,40,66,3,6,9,131,182,313,1,1,2,0,0,0,0,0,0,0,0,0,0,0,0,0,0,0,0,10,10,5,25,2,0,2,1,0,1,87,313,87,313,8,25,"Yes","Yes",2,0,24,9,26,9,0,"Yes","No","Yes","No","Yes","No",0.2,0.2,0,0,0.2,0.2,0.2,"Communal","Yes","Community/religious building","76-95%","0%","Yes","Other","No",6,5,7,"Yes","Identified waste dump outside camp","Hospital",null,"Yes","No","Yes","No","No","No","No","Yes","No","No","76-95%","76-95%","Trade (buying and selling)","Other","Farming","Mining","None","None","Farming","Trade (buying and selling)","Cash/money assistance","Cash/money assistance","Well / water tank                          ","Health facility / Clinic                                         ","Medicines","Blankets/Winter Clothing                                         ","KBC, UNHCR","Shalom, UNHCR"]
["H011","30/7/2013","UNHCR",null,"CCCM Focal Point",null,"14/6/2013","Camp Manager","Male",null,null,"Committee Member","Camp Resident","Male",null,null,"Kachin","Hpakant","Seik Mu","Maw Shan","Maw Wan, Mu-yin Baptist Church","MMR001CMP091",96.319687999999999,25.615202,"Urban",8,2012,"Yes","Yes","Yes","No","Yes","Yes","Yes","No","Hpakan",1,0,"Yes","Maw Wan, Mu-yin Baptist Church","Sa Yar Zaw Taung","09-47015499","Yes","Yes","No","No","No","No","Yes","No","No","No","Yes","Yes",0,0,0,1,1,2,4,1,5,5,4,9,0,0,0,2,3,5,3,2,5,0,1,1,15,12,27,0,0,0,0,0,0,0,0,0,0,0,0,0,0,0,0,0,0,0,0,0,1,3,0,0,0,0,0,0,5,27,5,27,43,211,"No","Yes",0,0,5,0,5,0,0,"Yes","No","Yes","No","Yes","No",0.125,null,0.125,0.25,0.25,0.25,0.25,"Individual","Yes","Community/religious building","0%","0%","Yes","Well","Yes",0,0,8,"Yes","Is getting burnt","Clinic",null,"No","No","No","No","No","No","No","No","No","Yes","96-100%","96-100%","Mining","None","Mining","None","None","None","Farming","Livestock","Cash/money assistance","Cash/money assistance",null,"School materials / supplies                                         ",null,"Basic Food                                       ","UNHCR"]
["E014","31/7/2013","KBSS/KMSS",null,"Enumerator from camp profiling  responsible organization",null,"14/6/2013","Camp Manager","Male",null,null,"Religious Leader",null,null,null,null,"Kachin","Hpakant","Nam Ma Hpyit","Nam Ma Hpyit","Nant Ma Hpit Catholic Church","MMR001CMP103",96.341352999999998,25.613894999999999,"Urban",8,2013,"Yes","Yes","Yes","No","Yes","Yes","Yes","No","Hpakant",null,15,"Yes","Rc","Mung Ban Aung ","09-400031602","Yes","No","No","No","Yes","No","No","Yes","No","Yes","Yes ","Yes",2,3,5,7,10,17,6,13,19,42,33,75,46,39,85,51,46,97,55,70,125,6,7,13,215,221,436,0,3,3,0,2,2,10,1,11,0,0,0,0,1,1,0,1,1,2,6,8,0,0,2,2,4,0,1,1,0,0,0,0,null,null,"No","Yes",2,2,8,1,10,3,7,"No","No","No","No","No","No",null,null,null,null,null,null,null,"Mixed","No","Solid shelters","25-50%","0%","No","Well","Yes",3,4,0,"Yes","Identified waste dump outside camp","Hospital",null,"No","Yes","No","Yes","No","No","No","No","No","No","less than 25%","less than 25%","Mining","None","Livestock","Mining","None","None","Farming","Trade (buying and selling)","Cash/money assistance","Cash/money assistance","Access to job opportunities        ","Access to job opportunities        ","Latrines/toilets                                      ","Vocational training                       ","UNHCR"]
["E016","31/7/2013","KBC",null,null,null,"17/6/2013","Camp Manager","Male",null,null,"Religious Leader",null,null,null,null,"Kachin","Hpakant","Seik Mu","Seik Mu","Yumar Baptist Church","MMR001CMP105",96.306910999999999,25.599250000000001,"Rural",8,2012,"Yes","Yes","Yes","No","Yes","Yes","Yes","No","Hpakant",null,5,"Yes","Yuma (KBC)","Rev.  U Naw Mai","09-400037875","Yes","Yes","No","No","No","No","No","No","Yes","No","Yes ","No",0,0,0,0,6,0,0,5,5,7,10,17,1,2,3,6,6,12,12,11,23,0,1,1,26,41,67,1,1,2,0,0,0,1,1,2,0,0,0,0,0,0,0,0,0,0,0,0,0,0,0,1,1,0,0,0,21,64,47,156,27,50,"Yes","Yes",2,0,3,3,5,3,1,"No","No","No","No","No","No",null,null,null,null,null,null,null,"Communal","Yes","Solid shelters","0%","0%","Yes","Other","Yes",0,0,6,"No","Identified waste dump outside camp","Clinic","No","No","No","No","No","No","No","No","No","No","Yes","96-100%","96-100%","Mining","Trade (buying and selling)","Trade (buying and selling)","Mining","Handicrafts","Other","Handicrafts","Other","Well / water tank                          ","Hygiene kits                                         ","Vocational training                       ","Access to job opportunities        ","Cash/money assistance","Cash/money assistance","UNHCR","Shalom, UNHCR"]
["D004","30/7/2013","UNHCR",null,"Enumerator from camp profiling  responsible organization",null,"13/6/2013","Camp Manager","Male",null,null,"Committee Member","Camp Resident","Female",null,null,"Kachin","Hpakant","Seik Mu","Sai Taung (Ywar Haung)","Chin Church, Seik Mu","MMR001CMP109",96.283377000000002,25.582065,"Rural",8,2013,"Yes","Yes","Yes","No","Yes","Yes","Yes","No","Hpakan",3,10,"Yes","Chin Baptist ","L Man Kyel","09-40000191","Yes","Yes","No","No","No","No","No","No","Yes","Yes","Yes","Yes",0,0,0,0,1,1,0,0,0,1,3,4,1,1,2,4,1,5,0,1,1,1,0,1,7,7,14,1,0,1,0,0,0,0,0,0,0,0,0,3,0,3,1,0,1,0,0,0,0,1,0,0,0,0,0,0,2,14,6,24,4,10,"No","Yes",0,0,4,1,4,1,0,"No","No","No","No","Yes","No",0.375,0.25,0.25,0.125,0.125,0.375,0.375,"Individual","Yes","Community/religious building","0%","0%","Yes","Rivers, springs, etc.","Yes",0,0,1,"No","Identified waste dump outside camp","Clinic",null,"No","No","No","No","No","No","No","No","No","Yes","76-95%","76-95%","Farming","None","Farming","Livestock","Farming","None","Farming","Livestock","Individual shelter/houses             ","Basic Food                                       ","Basic Food                                       ","Well / water tank                          ","Well / water tank                          ",null,"UNHCR"]
["F007","30/7/2013","DRC",null,"Enumerator from camp profiling  responsible organization",null,"23/6/2013","Camp Manager","Male",null,null,"Religious Leader","Camp Resident","Female",null,null,"Kachin","Waingmaw","Saga Pa (Sadung Sub-township)","Zai Aung","Zai Awng / Mung Ga Zup","MMR001CMP111",97.756789999999995,25.106670000000001,"Rural",11,2011,"Yes","Yes","Yes","No","Yes","No","No","No","Waingmaw",60,null,"Yes","IRRC","Kareng La Nu","1539 4803029","Yes","No","No","Yes","No","No","Yes","No","No","No","Yes","No",16,12,28,37,26,63,127,118,245,278,261,539,187,186,373,219,358,577,241,366,607,105,81,186,1210,1408,2618,10,12,22,3,0,3,53,69,122,0,0,0,0,0,0,3,7,10,41,5,46,42,78,15,8,23,7,1,8,630,2618,11,25,3,10,"Yes","Yes",19,4,0,1,19,5,3,"Yes","Yes","No","Yes","Yes","No",null,null," ",null,null,null,null,"Individual","Yes","Solid shelters","76-95%","less than 25%","Yes","Rivers, springs, etc.","No",0,0,80,"No","Is getting burnt","Clinic",null,"Yes","No","Yes","No","Yes","No","Yes","No","No","No","76-95%","76-95%","Other","None","Farming","Livestock","Other","None","Farming","Livestock","School facilities","Access to job opportunities        ","Other","Cash/money assistance","Other","Kitchen sets                                         ","IRRC, UNHCR, KBC, DRC","KBC, UNHCR"]
["F009","30/7/2013","DRC",null,"Enumerator from camp profiling  responsible organization",null,"24/6/2013","Camp Manager","Male",null,null,"Authority","Camp Resident","Male",null,null,"Kachin","Waingmaw","Saga Pa (Sadung Sub-township)","Saga Pa","Border Post 8","MMR001CMP113",97.915833000000006,25.220278,"Forest/bush",11,2011,"Yes","Yes","Yes","No","Yes","Yes","Yes","No","Sadung",30,720,"Yes","IRRC","U Maran Naw","1539 39 27048","Yes","No","Yes","No","No","No","No","No","Yes","Yes","Yes","No",2,5,7,16,11,27,36,26,62,75,70,145,31,26,57,55,77,132,50,65,115,23,41,64,288,321,609,4,1,5,4,0,4,4,1,5,8,9,17,3,2,5,3,2,5,0,4,4,5,67,2,17,19,2,13,15,132,549,41,206,0,0,"Yes","Yes",6,4,1,0,7,4,1,"Yes","Yes","No","Yes","Yes","No",15,null,null,null,null,null,30,"Individual","Yes","Solid shelters","25-50%","less than 25%","Yes","Rivers, springs, etc.","Yes",0,0,90,"No","Common identified waste dump inside camp","Clinic",null,"No","Yes","Yes","Yes","Yes","No","Yes","No","No","No","51-75%","25-50%","Other","None","Farming","Trade (buying and selling)","None","None","Farming","Trade (buying and selling)","Other","Other","School facilities","School facilities","Individual shelter/houses             ","Communal building                      ","UNHCR, KMSS, DRC","KMSS, UNHCR"]
["F006","30/7/2013","DRC",null,"Enumerator from camp profiling  responsible organization",null,"23/6/2013","Camp Resident","Male",null,null,"Committee Member","Camp Resident","Male",null,null,"Kachin","Waingmaw","Saga Pa (Sadung Sub-township)","Hkau Shau","Hkau Shau (BP 12)","MMR001CMP115",97.807182999999995,25.200333000000001,"Rural",12,2011,"Yes","Yes","Yes","No","Yes","Yes","Yes","No","Shadung",null,600,"Yes","IRRC","Ngw si le",6245531,"Yes","No","NO","No","Yes","No","No","No","Yes","No","Yes","No",1,3,4,28,10,38,41,39,80,133,122,255,87,102,189,168,143,311,99,111,210,40,33,73,597,563,1160,6,0,6,1,2,3,2,2,4,0,0,0,5,1,6,0,1,1,0,3,3,21,33,4,0,4,0,0,0,171,1164,5,44,5,40,"Yes","Yes",9,3,1,0,10,3,2,"Yes","Yes","No","Yes","Yes","No",null,null,null,null,null,null,null,"Individual","No","Solid shelters","96-100%","0%","Yes","Rivers, springs, etc.","No",0,0,60,"No","Is getting burnt","Hospital",null,"No","Yes","No","Yes","Yes","No","No","No","No","No","51-75%","25-50%","None","None","Farming","Livestock","None","None","Livestock","Trade (buying and selling)","Other","Other","Other","Well / water tank                          ","Well / water tank                          ","Access to job opportunities        ","KBC, DRC","Shalom, DRC"]
["H008","30/7/2013","DRC",null,"Enumerator from camp profiling  responsible organization",null,"25/6/2013","Camp Resident","Male",null,null,"Committee Member","Camp Manager","Male",null,null,"Kachin","Waingmaw","Nam Sang Yang","Nam Sang Yang","Woi Chyai ","MMR001CMP116",97.567116999999996,24.768383,"Urban",6,2011,"Yes","Yes","Yes","No","Yes","Yes","Yes","No","Laiza",0,0,"Yes","IRRC","N Gang Ja La","153686 6579 43","Yes","No","No","Yes","No","No","No","No","Yes","No","Yes","Yes",21,26,47,89,66,155,47,62,109,82,108,190,329,347,676,333,388,721,1027,1066,2093,161,152,313,2089,2215,4304,28,20,48,0,1,1,8,2,10,0,0,0,0,0,0,1,0,1,0,114,114,40,96,6,13,19,0,0,0,842,4304,13,58,2,13,"Yes","Yes",5,1,1,0,6,1,2,"Yes","Yes","No","No","No","No",1,null,0.25,null,0.75,null,null,"Individual","Yes","Community/religious building","25-50%","0%","Yes","Rivers, springs, etc.","No",0,0,73,"No","Is getting burnt","Hospital",null,"Yes","No","No","Yes","Yes","Yes","Yes","No","No","No","96-100%","96-100%","Trade (buying and selling)","Other","Farming","Trade (buying and selling)","Other","None","Farming","Livestock","Well / water tank                          ","Complementary Food                                 ","Cash/money assistance","Women NFIs (sanitary pads, underwear, etc.)","Vocational training                       ","Cash/money assistance","DRC, Shalom"]
["H007","30/7/2013","DRC",null,"Enumerator from camp profiling  responsible organization",null,"26/6/2013","Camp Resident","Male",null,null,"Committee Member","Other","Female",null,null,"Kachin","Waingmaw","Nam Sang Yang","Nam Sang Yang","Laiza Market 3 / Laiza Gat","MMR001CMP117",97.551716999999996,24.746817,"Urban",6,2011,"Yes","Yes","Yes","No","Yes","Yes","Yes","No","Laiza",null,10,"Yes","IRRC","Mading Tu Mai","89 34002","Yes","No","No","No","Yes","No","No","No","Yes","No","Yes","No",3,9,12,34,32,66,84,91,175,201,202,403,122,163,285,152,341,493,147,290,437,58,82,140,801,1210,2011,12,3,15,1,1,2,10,9,19,0,0,0,1,0,1,2,5,7,0,18,18,10,25,10,8,18,0,0,0,467,2011,4,16,1,7,"No","Yes",2,1,1,0,3,1,1,"Yes","Yes","Yes","Yes","Yes","No",2,null,null,0.125,1.1000000000000001,1.1000000000000001,1.1000000000000001,"Individual","Yes","Community/religious building","25-50%","51-75%","Yes","Other","No",0,0,4,"No","Is getting burnt","Clinic",null,"No","Yes","No","No","Yes","Yes","No","No","Yes","No","76-95%","25-50%","Other","None","Farming","Livestock","Other","None","Farming","Trade (buying and selling)","Complementary Food                                 ","Cash/money assistance","School materials / supplies                                         ","Latrines/toilets                                      ","Cash/money assistance","Bathing spaces                                      "]
["F010","31/7/2013","DRC",null,"Enumerator from camp profiling  responsible organization",null,"23/6/2013","Camp Resident","Male",null,null,"Committee Member","Camp Resident","Male",null,null,"Kachin","Waingmaw","Ma Ga Ran Yang","Ma Ga Ran Yang","Maga Yang ","MMR001CMP119",97.715230000000005,24.980250000000002,"Rural",6,2011,"Yes","Yes","Yes","No","Yes","Yes","No","No","Waingmaw",60,240,"Yes","IRRC","Kawje Yaw San","18008829 779","Yes","No","No","Yes","No","No","No","No","Yes","No","Yes","Yes",27,22,49,31,29,60,158,135,293,283,314,597,198,210,408,234,291,525,304,379,683,102,125,227,1337,1505,2842,20,9,29,1,1,2,5,8,13,12,12,24,1,0,1,0,0,0,0,20,20,27,23,12,8,20,6,6,12,627,2842,23,75,0,0,"Yes","Yes",10,1,1,0,11,1,1,"No","No","Yes","No","No","No",6,null,null,null,null,null,50,"Individual","Yes","Solid shelters","96-100%","0%","Yes","Rivers, springs, etc.","Yes",0,0,190,"No","Identified waste dump outside camp","Clinic",null,"Yes","Yes","Yes","Yes","Yes","Yes","Yes","Yes","No","No","76-95%","76-95%","None","None","Farming","Livestock","Livestock","Trade (buying and selling)","Farming","Livestock","Well / water tank                          ","Well / water tank                          ","Access to job opportunities        ","Access to job opportunities        ","School materials / supplies                                         ","Medicines","IRRC, KMSS, UNHCR","KMSS, DRC"]
["C010","30/7/2013","RANIR",null,"Enumerator from camp profiling  responsible organization",null,"23/6/2013","Camp Resident","Male",null,null,"Committee Member","Other","Male",null,null,"Kachin","Waingmaw","Nam Sang Yang","Pa Jau","Pajau / Jan Mai","MMR001CMP120",97.751389000000003,24.831944,"Rural",7,2011,"Yes","Yes","Yes","No","Yes","Yes","Yes","No","Waingmaw",80,270,"Yes","IDP and Refugee Relief Committee (IRRC)","U Zaw Tar","+86 13368827604","Yes","No","No","Yes","No","No","No","No","Yes","No","Yes","No",6,4,10,12,6,18,11,12,23,24,19,43,7,4,11,16,50,66,6,21,27,6,7,13,88,123,211,0,0,0,1,1,2,0,0,0,1,4,5,7,1,8,0,0,0,0,2,2,11,18,1,1,2,0,0,0,60,211,9,24,13,35,"No","Yes",0,0,5,1,5,1,1,"No","No","No","No","No","Yes",null,null,null,null,null,null,null,"Individual","Yes","Solid shelters","76-95%","0%","Yes","Rivers, springs, etc.","Yes",0,0,11,"No","Identified waste dump outside camp","Rural centre",null,"No","Yes","Yes","Yes","Yes","Yes","Yes","Yes","Yes","No","96-100%","96-100%","None","None","Farming","Livestock","Handicrafts","None","Farming","Livestock","Cash/money assistance","Cash/money assistance","Firewood / fuel                                                                      ","Other","Vocational training                       ",null,"KBC, DRC","KBC, UNHCR"]
["B010","30/7/2013","RANIR",null,"Enumerator from camp profiling  responsible organization",null,"24/6/2013","Camp Manager","Male",null,null,"Authority","Camp Resident","Male",null,null,"Kachin","Momauk","Ton Hone Yang (Dawthponeyan Sub-township)","Laiza","Je Yang Hka ","MMR001CMP121",97.568282999999994,24.688167,"Rural",6,2012,"Yes","Yes","Yes","No","Yes","Yes","Yes","No","Laiza",5,30,"Yes","IRRC","U Brang Shaung","86-13312722011","Yes","Yes","No","No","No","No","Yes","No","No","No","Yes","No",153,173,326,188,173,361,345,365,710,932,702,1634,643,663,1306,1045,1026,2071,805,878,1683,202,233,435,4313,4213,8526,49,7,56,0,0,0,9,16,25,0,0,0,5,6,11,2,4,6,0,75,75,78,84,21,26,47,8,6,14,1643,8556,15,112,1,3,"Yes","Yes",4,1,6,1,10,2,3,"Yes","Yes","Yes","Yes","Yes","No",null,null,null,null,null,null,5,"Individual","Yes","Solid shelters","25-50%","0%","No","Rivers, springs, etc.","No",0,0,497,"No","Is getting burnt","Hospital",null,"Yes","Yes","Yes","Yes","Yes","Yes","Yes","Yes","Yes","No","76-95%","76-95%","Farming","Other","Farming","Trade (buying and selling)","Trade (buying and selling)","Other","Farming","Trade (buying and selling)","Basic Food                                       ","Basic Food                                       ","School facilities","Medicines","Cash/money assistance","Cash/money assistance","IRRC, UNHCR","KBSS, UNHCR, DRC"]
["F008","30/7/2013","DRC",null,"Enumerator from camp profiling  responsible organization",null,"22/6/2013","Camp Manager","Male",null,null,"Authority","Other","Female",null,null,"Kachin","Momauk","In Baw Mai Kyin (Dawthponeyan Sub-township)","Hpun Lum Yang","Hpun Lum Yang ","MMR001CMP122",97.573166999999998,24.661466999999998,"Rural",6,2011,"Yes","Yes","Yes","No","Yes","Yes","Yes","No","Laiza/ Daw hpung Yang",2,30,"Yes","IRRC","Lashi Tang Gum","133249 75780","Yes","No","No","Yes","No","No","No","No","Yes","No","Yes","Yes",18,15,33,20,28,48,76,81,157,167,237,404,196,183,379,256,218,474,292,237,529,43,76,119,1068,1075,2143,0,0,0,1,0,1,0,2,2,0,0,0,3,4,7,0,0,0,0,110,110,29,64,9,13,22,7,2,9,439,2144,9,32,11,58,"Yes","Yes",11,4,3,1,14,5,3,"Yes","Yes","Yes","Yes","Yes","No",2,null,null,null,null,2,2,"Individual","Yes","Solid shelters","96-100%","0%","No","Well","Yes",0,0,180,"No","Is getting burnt","Clinic",null,"Yes","Yes","Yes","Yes","Yes","Yes","Yes","Yes","Yes","No","96-100%","76-95%","Handicrafts","Other","Farming","Livestock","Other","None","Farming","Livestock","Medicines","Other","Firewood / fuel                                                                      ","Complementary Food                                 ","Cash/money assistance","Other","IRRC, UNHCR","KMSS, Shalom, DRC"]
["B008","30/7/2013","RANIR",null,"Enumerator from camp profiling  responsible organization",null,"22/6/2013","Camp Resident","Male",null,null,"Committee Member","Camp Resident","Female",null,null,"Kachin","Momauk","Zee Wone Gawt","Dum Bung","Dum Bung ","MMR001CMP123",97.537099999999995,24.461033,"Forest/bush",8,2011,"Yes","Yes","Yes","No","Yes","Yes","No","No","Momauk",25,180,"Yes","IRRC","U Htwe Lum","86-15368652887","Yes","No","No","Yes","No","No","No","No","Yes","Yes","Yes","Yes",4,6,10,9,8,17,26,29,55,28,75,103,40,39,79,64,53,117,69,73,142,21,17,38,261,300,561,3,4,7,0,0,0,1,3,4,0,0,0,0,0,0,0,0,0,0,70,70,11,7,6,1,7,1,1,2,118,591,2,12,4,19,"Yes","Yes",5,5,1,0,6,5,0,"Yes","Yes","No","Yes","Yes","No",null,null,null,null,null,null,null,"Individual","Yes","Solid shelters","96-100%","0%","Yes","Rivers, springs, etc.","Yes",0,0,126,"No","Common identified waste dump inside camp","Clinic",null,"Yes","Yes","Yes","Yes","Yes","No","Yes","Yes","No","No","76-95%","76-95%","None","None","Farming","Livestock","None","None","Farming","Livestock","Complementary Food                                 ","Basic Food                                       ","Vocational training                       ","Blankets/Winter Clothing                                         ","Blankets/Winter Clothing                                         ","Medicines","UNHCR","KMSS, UNHCR"]
["C007","30/7/2013","RANIR",null,"Enumerator from camp profiling  responsible organization",null,"24/6/2013","Camp Manager","Male",null,null,"Authority","Camp Resident","Female",null,null,"Kachin","Momauk","Kawng Hsa (Lwegel Sub-township)","Mai Gyar Yang","Pa Kahtawng ","MMR001CMP126",97.752667000000002,24.2744,"Rural",4,2012,"Yes","Yes","Yes","No","Yes","Yes","Yes","No","Loi Je",7,15,"Yes","IDP and Refugee Relief Committee (IRRC)","U Zaw Bawk","+86 13578285542","Yes","No","No","Yes","No","No","No","Yes","No","No","Yes","Yes",8,15,23,39,34,73,120,122,242,388,363,751,412,433,845,133,271,404,138,245,383,56,98,154,1294,1581,2875,7,2,9,0,0,0,9,6,15,0,0,0,494,561,1055,1,0,1,0,171,171,26,20,19,11,30,7,3,10,503,2875,21,627,5,11,"Yes","Yes",2,2,7,0,9,2,1,"Yes","Yes","Yes","No","Yes","No",1.5,null,null,null,null,1.5,1.5,"Individual","Yes","Solid shelters","96-100%","0%","No","Rivers, springs, etc.","Yes",55,62,117,"Yes","Is getting burnt","Clinic",null,"Yes","Yes","Yes","Yes","Yes","Yes","Yes","Yes","Yes","No","76-95%","76-95%","Handicrafts","Other","Farming","Livestock","Handicrafts","Other","Farming","Livestock","Basic Food                                       ","Blankets/Winter Clothing                                         ","Complementary Food                                 ","Cash/money assistance","Cash/money assistance","Firewood / fuel                                                                      ","UNHCR","KBSS, UNHCR"]
["C008","30/7/2013","RANIR",null,"Enumerator from camp profiling  responsible organization",null,"21/6/2013","Other","Male",null,null,"Authority","Other","Male",null,null,"Kachin","Mansi","In Ba Pa","La Na","Lana Zup Ja ","MMR001CMP128",97.625617000000005,24.056132999999999,"Rural",10,2011,"Yes","Yes","Yes","No","Yes","Yes","Yes","No","Loi Je",24,150,"Yes","IDP and Refugee Relief Committee (IRRC)","U Tan Gun","+86 18387503436","Yes","No","No","Yes","No","No","No","No","Yes","No","Yes","Yes",6,4,10,16,20,36,43,45,88,109,90,199,26,21,47,49,102,151,62,101,163,16,33,49,327,416,743,5,10,15,0,3,3,18,14,32,0,0,0,6,4,10,3,10,13,4,10,14,6,42,6,4,10,0,1,1,173,741,3,15,3,15,"Yes","Yes",5,3,0,1,5,4,0,"Yes","Yes","Yes","No","Yes","No",27,null,null,null,null,4,27,"Individual","Yes","Solid shelters","76-95%","0%","Yes","Rivers, springs, etc.","Yes",20,21,0,"No","Identified waste dump outside camp","Clinic",null,"Yes","Yes","Yes","No","Yes","Yes","Yes","Yes","Yes","No","76-95%","96-100%","Other","None","Farming","Other","Farming","Livestock","Farming","Livestock","Latrines/toilets                                      ","Cash/money assistance","Cash/money assistance","Other","Well / water tank                          ","Well / water tank                          ","UNHCR","KBSS, UNHCR"]
["B007","30/7/2013","RANIR",null,"Enumerator from camp profiling  responsible organization",null,"22/6/2013","Camp Manager","Male",null,null,"Authority","Camp Resident","Female",null,null,"Kachin","Mansi","Dum Buk","Dum Buk","Bum Tsit Pa ","MMR001CMP129",97.609832999999995,24.002433,"Rural",10,2011,"Yes","Yes","Yes","No","Yes","Yes","No","No","Lwaije",20,120,"Yes","IRRC","U Tu Lum",866221601,"Yes","Yes","No","No","No","No","No","No","Yes","No","Yes","No",29,40,69,24,35,59,125,135,260,340,308,648,258,259,517,167,327,494,170,274,444,58,75,133,1171,1453,2624,18,15,33,85,46,131,1,2,3,0,0,0,58,72,130,0,0,0,111,65,176,22,130,9,9,18,6,3,9,551,2624,15,57,34,135,"No","Yes",3,0,6,0,9,0,1,"Yes","Yes","No","Yes","Yes","No",null,null,null,null,null,null,20,"Individual","No","Solid shelters","less than 25%","0%","No","Well","Yes",0,0,70,"No","Is getting burnt","Rural centre",null,"Yes","Yes","Yes","No","Yes","Yes","Yes","Yes","Yes","No","96-100%","76-95%","Other","None","Other",null,"Farming","Other","Farming","Livestock","Basic Food                                       ","Well / water tank                          ","Medicines","Cash/money assistance","Cash/money assistance","Blankets/Winter Clothing                                         ","UNHCR"]
["C006","30/7/2013","RANIR",null,"Enumerator from camp profiling  responsible organization",null,"23/6/2013","Camp Manager","Male",null,null,"Authority","Camp Resident","Female",null,null,"Kachin","Momauk","Ba Lawng Kawng (Lwegel Sub-township)","Hpa Lum","Nhkawng Pa ","MMR001CMP131",97.669366999999994,24.378167000000001,"Rural",4,2012,"Yes","Yes","Yes","No","Yes","Yes","Yes","No","Momauk",null,180,"Yes","IDP and Refugee Relief Committee (IRRC)","U Pan Awng","+86 15368662827","Yes","No","No","Yes","No","No","No","No","Yes","No","Yes","Yes",4,12,16,21,21,42,80,69,149,175,172,347,105,96,201,76,154,230,142,227,369,78,94,172,681,845,1526,1,12,13,0,0,0,3,1,4,0,0,0,1,4,5,2,2,4,0,126,126,19,55,7,11,18,5,2,7,380,1525,0,0,null,null,"No","Yes",3,1,4,1,7,2,2,"Yes","Yes","No","No","No","No",null,null,null,null,null,null,20,"Individual","Yes","Solid shelters","96-100%","0%","Yes","Rivers, springs, etc.","Yes",10,10,71,"No","Common identified waste dump inside camp","Clinic",null,"Yes","Yes","Yes","Yes","Yes","Yes","Yes","Yes","Yes","No","76-95%","76-95%","Other","None","Farming","Livestock","Other","None","Farming","Livestock","Medicines","School materials / supplies                                         ","Complementary Food                                 ","Vocational training                       ","Partitions within shelters","Latrines/toilets                                      ","UNHCR"]
["I001","30/7/2013","KBSS/KMSS",null,"CCCM Focal Point",null,"21/6/2013","Camp Manager","Male",null,null,"Committee Member",null,null,null,null,"Kachin","Mansi","Man Mawn","Man Mawn","Man Wing Catholic Church","MMR001CMP132",97.334630000000004,23.51491,"Rural",11,2011,"Yes","Yes","Yes","No","Yes","Yes","Yes","No","Man Si",7,30,"Yes","IRRC/KMSS","Sr.Galau Naw Aung","133249 7589 8","Yes","No","No","Yes","No","No","No","Yes","No","No","Yes","No",11,8,19,25,32,57,66,59,125,223,176,399,140,132,272,120,168,288,125,200,325,43,64,107,753,839,1592,13,8,21,1,1,2,2,1,3,1,3,4,4,5,9,8,11,19,9,68,77,13,40,0,0,0,3,2,5,308,0,20,100,5,23,"No","Yes",4,3,0,0,4,3,2,"Yes","Yes","Yes","No","Yes","No",7,null,null,null,null,1.5,1.5,"Individual","Yes","Solid shelters","0%","0%","Yes","Borehole/hand pump","No",30,35,30,"Yes","Common identified waste dump inside camp","Clinic",null,"No","Yes","Yes","Yes","Yes","Yes","Yes","No","Yes","No","96-100%","96-100%","Farming","None","Farming","None","Farming","None","Farming","Livestock","Well / water tank                          ","Well / water tank                          ","Medical staff (doctor, nurse, etc)","Medical staff (doctor, nurse, etc)","Vocational training                       ","Vocational training                       ",null,"KBSS, UNHCR"]
["E010","30/7/2013","KBC",null,"CCCM Focal Point",null,"21/6/2013","Camp Manager","Male",null,null,"Religious Leader",null,null,null,null,"Kachin","Mansi","Man Mawn","Man Mawn","Man Wing Baptist Church","MMR001CMP133",97.587900000000005,23.83,"Rural",2,2012,"Yes","Yes","Yes","No","Yes","Yes","Yes","No","Nam kham",null,null,"Yes","Management Committee","U Tu Lum","189 88225035","Yes","No","No","Yes","No","No","No","No","Yes","Yes","Yes ","Yes",2,1,3,8,5,13,44,42,86,79,80,159,22,16,38,56,70,126,44,60,104,8,12,20,263,286,549,2,2,4,0,0,0,0,2,2,0,3,3,0,0,0,0,0,0,0,2,2,1,16,2,1,3,0,0,0,111,549,9,49,7,28,"No","Yes",2,0,14,7,16,7,4,"No","No","No","No","No","No",null,null,null,null,null,null,null,"Individual","Yes","Solid shelters",null,null,"No","Borehole/hand pump","Yes",8,8,0,"Yes","Common identified waste dump inside camp","Rural sub-centre","No","Yes","Yes","Yes","No","Yes","Yes","Yes","No","No","No","96-100%","96-100%","Farming","None","Farming",null,"Farming","None","Farming","Farming",null,null,null,null,null,null,"UNHCR","KBC, UNHCR, DRC"]
["B009","30/7/2013","RANIR",null,"Enumerator from camp profiling  responsible organization",null,"24/6/2013","Camp Manager","Male",null,null,"Committee Member","Camp Resident","Male",null,null,"Kachin","Mansi","La Gat Dawt","La Gat Dawt","Lung Kawk  ( Hka Hkye Zup)","MMR001CMP135",97.585667000000001,23.9055,"Forest/bush",8,2012,"Yes","Yes","Yes","No","Yes","Yes","No","No","Nam Hkam",15,90,"Yes","IRRC","U N-hkum Naw","86-89 13038","Yes","Yes","No","No","No","No","No","No","Yes","No","Yes","No",3,3,6,1,1,2,15,13,28,28,28,56,10,4,14,34,52,86,29,42,71,13,20,33,133,163,296,1,1,2,2,0,2,5,2,7,0,0,0,3,2,5,0,1,1,0,17,17,2,9,2,1,3,1,0,1,85,296,4,12,0,0,"No","Yes",7,1,1,0,8,1,1,"Yes","Yes","No","No","Yes","No",5,null,null,null,null,5,5,"Individual","Yes","Solid shelters","96-100%","0%","Yes","Well","Yes",0,0,12,"Yes","Identified waste dump outside camp","Rural centre",null,"No","Yes","Yes","No","Yes","No","No","No","No","No","96-100%","96-100%","Other","None","Farming","Livestock","Farming","Other","Farming","Livestock","Other","Cash/money assistance","Medicines","Latrines/toilets                                      ","Well / water tank                          ","Complementary Food                                 ","UNHCR"]
["F004","30/7/2013","KBC",null,"CCCM Focal Point",null,"21/6/2013","Camp Manager","Male",null,null,"Religious Leader","Camp Resident","Female",null,null,"Shan (North)","Namhkan","Maw Hsway","Maw Hsway","Nam Hkawng","MMR015CMP139",null,null,"Rural",9,2011,"Yes","Yes","Yes","No","Yes","Yes","Yes","No","Mong Paw",null,null,"Yes","KBC","Rev. Bawk Naw","68809 43","Yes","No","No","Yes","No","No","Yes","No","No","Yes","Yes","No",0,0,0,1,2,3,3,4,7,6,14,20,2,0,2,3,2,5,5,5,10,1,3,4,21,30,51,0,0,0,0,0,0,0,0,0,0,0,0,2,3,5,0,1,1,0,1,1,0,0,0,0,0,0,0,0,11,51,0,0,2,8,"No","Yes",1,1,1,0,3,1,1,"Yes","Yes","Yes","Yes","Yes","No",null,null,null,null,null,null,null,"Individual","No","Solid shelters","25-50%",null,"Yes","Well","Yes",0,0,0,"NO","Common identified waste dump inside camp","Rural sub-centre",null,"No","No","No","No","No","Yes","No","No","No","No","less than 25%","less than 25%","Other","None","Farming","Other","Other","None","Farming","Other","Firewood / fuel                                                                      ","Cash/money assistance","Health facility / Clinic                                         ","Complementary Food                                 ","Partitions within shelters","Access to job opportunities        ","KBC, UNHCR"]
["B013","31/7/2013","KBC",null,"CCCM Focal Point",null,"28/6/2013","Camp Manager","Male",null,null,"Religious Leader",null,null,null,null,"Kachin","Hpakant","Nam Si In (Karmaing Sub-township)","Nam Si In","Hlaing Naung Baptist","MMR001CMP148",96.705960000000005,25.51352,"Rural",10,2012,"Yes","Yes","Yes","No","Yes","Yes","Yes","No","Hpakan",null,20,"Yes","KBC","Rev. U Hpaw Wam La Seng","09-47015215","Yes","No","No","Yes","No","No","No","No","Yes","No","Yes","Yes",0,1,1,2,0,2,3,1,4,6,3,9,7,12,19,1,5,6,3,7,10,0,2,2,22,31,53,1,0,1,0,0,0,1,1,2,0,0,0,0,0,0,0,1,1,0,0,0,0,2,0,1,1,0,0,0,23,58,10,25,14,94,"No","Yes",0,2,5,2,5,4,2,"Yes","Yes","No","No","No","No",0.375,null,null,null,null,null,null,"Individual","No","Solid shelters","0%","0%",null,"Borehole/hand pump","Yes",0,0,3,"No","Common identified waste dump inside camp","Hospital",null,"No","Yes","No","No","No","No","No","No","No","No","96-100%","96-100%","Farming","Other","Farming","Other","Farming","Other","Other",null,"Blankets/Winter Clothing                                         ","Blankets/Winter Clothing                                         ","Medicines","Vocational training                       ","Kitchen sets                                         ","Latrines/toilets                                      ","KBC, UNHCR"]
["C011","30/7/2013","DRC",null,"Enumerator from camp profiling  responsible organization",null,"25/6/2013","Camp Resident","Female",null,null,"Doctor / Nurse / Midwife","Camp Resident","Female",null,null,"Kachin","Waingmaw","Saga Pa (Sadung Sub-township)",null,"Post 6 Camp","MMR001CMP160",97.990555999999998,25.265277999999999,"Forest/bush",11,2011,"Yes","Yes","Yes","No","Yes","Yes","No","No","Waingmaw",null,480,"Yes","IDP and Refugee Relief Committee (IRRC)","U Ying Bawm","+86 (0692)68709 68","Yes","No","Yes","No","No","No","No","Yes","No","No","Yes","No",1,1,2,10,3,13,26,21,47,59,70,129,70,61,131,86,94,180,53,54,107,13,18,31,318,322,640,2,0,2,0,0,0,3,2,5,1,3,4,6,7,13,1,2,3,0,24,24,6,10,1,0,1,2,0,2,120,640,5,15,5,19,"No","Yes",12,1,2,0,14,3,2,"Yes","Yes","No","Yes","Yes","No",32,3,null,null,null,null,null,"Individual","Yes","Solid shelters","25-50%","25-50%","Yes","Rivers, springs, etc.","Yes",0,0,80,"No","Identified waste dump outside camp","Clinic",null,"No","Yes","No","Yes","Yes","Yes","Yes","Yes","No","No","96-100%","96-100%","None","None","Farming","Livestock","Other","None","Farming","Livestock","Other","Cash/money assistance","Complementary Food                                 ","Vocational training                       ","Medical staff (doctor, nurse, etc)","Access to job opportunities        ","UNHCR, KMSS, DRC","KMSS, UNHCR"]
["I005","30/7/2013","KBSS/KMSS",null,"CCCM Focal Point",null,"15/6/2013","Camp Manager","Male",null,null,"Committee Member",null,null,null,null,"Kachin","Myitkyina","Pa La Na Sa Khan Myar","Pi Tauk Myaing","Pa Dauk Myaing(Pa La Na)","MMR001CMP162",97.4345,25.493819999999999,null,12,2012,"Yes","Yes","Yes","No","Yes","Yes","Yes","No","Myitkyina",8,60,"Yes","KMSS","U Naw Hkum Shan Grawng","09-401539564","Yes","No","Yes","No","No","No","No","No","Yes","Yes","Yes","Yes",1,3,4,3,7,10,5,8,13,20,13,33,13,22,35,15,17,32,14,17,31,4,1,5,75,88,163,2,1,3,1,0,1,2,2,4,0,0,0,0,3,3,0,0,0,0,3,3,3,10,1,3,4,0,0,0,31,163,0,0,null,null,"No","Yes",2,null,4,1,6,1,null,"Yes","Yes","No","No","Yes","No",0.25,null,0.25,0.375,0.375,0.375,0.375,"Communal","No","Community/religious building","96-100%","96-100%","No","Well","Yes",0,0,1,"No","Is getting burnt","Clinic",null,"No","No","No","No","No","No","No","No","No","No","76-95%","76-95%","Other","None","Farming","Livestock","Other","None","Farming","Farming","Medical staff (doctor, nurse, etc)","Kitchen sets                                         ","School facilities","Hygiene kits                                         ","Transport to school                     ","Transport to school                     ","UNHCR"]
["D003","30/7/2013","OTHER","Lisu Baptist","Other","Enumerator","17/6/2013","Camp Manager","Male",null,null,"Committee Member","Camp Resident","Female",null,null,"Kachin","Hpakant","Urban","Maw Wan","Lisu Baptist Church, Maw Wan Ward","MMR001CMP167",96.316400000000002,25.61842,"Rural",1,2013,"Yes","Yes","Yes","No","Yes","Yes","Yes","No","Hpakan",0,1,"Yes","Lisu Baptist","Saya U Lel Mel Hu","09-47126916","Yes","No","No","Yes","No","No","No","Yes","No","No","No","No",0,0,0,2,0,2,0,1,1,3,3,6,2,1,3,0,0,0,5,6,11,1,3,4,13,14,27,0,0,0,0,0,0,0,0,0,0,0,0,0,0,0,0,0,0,0,3,3,0,2,0,0,0,0,0,0,8,27,8,27,4,16,"No","Yes",1,0,3,1,4,1,0,"Yes","Yes","Yes","Yes","Yes","No",0.125,0,0.125,0.125,0.125,0.125,0.125,"Mixed","Yes","Community/religious building","96-100%","0%","No","Well","Yes",0,0,2,"No","Identified waste dump outside camp","Clinic",null,"No","No","No","No","No","No","No","No","No","Yes","96-100%","96-100%","Mining","Other","Farming","Other","Handicrafts","Other","Farming","Livestock","Basic Food                                       ","Cash/money assistance","Access to job opportunities        ","Access to job opportunities        ","Cash/money assistance","Complementary Food                                 ","KBC, UNHCR"]
["E013","31/7/2013","KBSS/KMSS",null,"Enumerator from camp profiling  responsible organization",null,"14/6/2013","Camp Manager","Male",null,null,"Religious Leader",null,null,null,null,"Kachin","Hpakant","Lone Khin","Lone Khin","5 Ward RC Church(lon Khin)","MMR001CMP168",96.353070000000002,25.655819999999999,"Rural",1,2013,"Yes","Yes","Yes","No","Yes","Yes","Yes","No","Hpakant",6,null,"Yes","KBC","U La Ja","074 7239 2","Yes","No","Yes","No","No","No","No","Yes","No","Yes","Yes ","Yes",4,2,6,8,4,12,13,15,28,44,41,85,46,46,92,37,51,88,55,57,112,5,16,21,212,232,444,0,0,0,0,0,0,1,1,2,0,0,0,0,0,0,0,0,0,0,0,0,2,8,2,2,4,1,0,1,99,444,227,845,128,401,"No","Yes",2,6,12,0,14,6,1,"No","No","No","No","No","No",null,null,null,null,null,null,null,"Mixed","No","Solid shelters","96-100%","0%","No","Well","Yes",0,0,10,"Yes","Identified waste dump outside camp","Clinic","No","No","No","No","No","No","No","No","No","No","Yes","76-95%","76-95%","Mining","None","Farming","Mining","Trade (buying and selling)","None","Livestock","Trade (buying and selling)","Well / water tank                          ","Well / water tank                          ","Cash/money assistance","Kitchen sets                                         ","Individual shelter/houses             ","Health facility / Clinic                                         ","KBC, UNHCR"]
["D002","30/7/2013","KBC",null,"Other","Enumerator","14/6/2013","Camp Manager","Male",null,null,"Committee Member","Camp Resident","Female",null,null,"Kachin","Hpakant","Lone Khin","Hmaw Si Zar","Baptist Church, Hmaw Si Sar(Lon Khin)","MMR001CMP169",96.346469999999997,25.647649999999999,"Rural",1,2013,"No","Yes","No","No","No","No","No","No","Hpakan",5,20,"Yes","Maw Si Sar Baptist","U Htu Kawng","09400033982","Yes","No","No","Yes","No","No","No","Yes","No","No","No","Yes",2,4,6,4,7,11,6,17,23,25,29,54,15,9,24,18,18,36,17,20,37,3,5,8,90,109,199,1,1,2,0,0,0,0,1,1,1,2,3,1,0,1,0,0,0,0,3,3,3,11,0,0,0,0,0,0,47,199,107,401,66,202,"No","Yes",0,0,4,0,4,0,1,"Yes","No","No","No","Yes","No",null,null,null,0.125,0.125,0.125,1,"Communal","Yes","Solid shelters","96-100%","96-100%","No","Well","Yes",4,4,0,"Yes","Identified waste dump outside camp","Other","Community Health Worker","No","No","No","Yes","No","No","No","No","No","No","96-100%","96-100%","Farming","Mining","Farming","Livestock","None","None","Farming","Livestock","Individual shelter/houses             ","Firewood / fuel                                                                      ","Cash/money assistance","Kitchen sets                                         ","Latrines/toilets                                      ","Cash/money assistance","UNHCR"]
["D008","31/7/2013","UNHCR",null,"Enumerator from camp profiling  responsible organization",null,"13/6/2013","Camp Manager","Male",null,null,"Committee Member","Camp Resident","Female",null,null,"Kachin","Hpakant","Lone Khin","Lone Khin","Baptist Church, Sai Ra village","MMR001CMP172",96.353070000000002,25.668469999999999,"Rural",1,2013,"Yes","Yes","Yes","No","Yes","Yes","Yes","No","Hpakan",8,20,"Yes","Government","U Yar Jar","09-400029893","Yes","No","Yes","No","No","No","No","No","Yes","No","No","Yes",1,0,1,0,0,0,2,3,5,1,0,1,2,2,4,2,2,4,2,2,4,1,2,3,11,11,22,0,1,1,0,0,0,0,1,1,0,0,0,0,0,0,0,0,0,0,0,0,0,1,1,0,1,0,0,0,5,23,5,23,25,110,"No","No",0,0,0,0,0,0,0,"No","No","No","No","Yes","No",0.125,0,0.125,0,0,1,1,"Communal","Yes","Solid shelters","96-100%","0%","No","Well","Yes",0,0,3,"No","Common identified waste dump inside camp","Hospital",null,"No","No","No","No","No","No","No","No","No","Yes","96-100%","96-100%","Other","None","Farming","Other","None","None","Other","None","Basic Food                                       ","Basic Food                                       ","Firewood / fuel                                                                      "]
["D007","30/7/2013","UNHCR",null,"Enumerator from camp profiling  responsible organization",null,"13/6/2013","Camp Manager","Male",null,null,"Committee Member","Camp Resident","Female",null,null,"Kachin","Hpakant","Lone Khin","Lone Khin","Dhama Rakhita, Nyein Chan Tar Yar Ward(Lon Khin)","MMR001CMP174",96.354929999999996,25.643090000000001,"Rural",1,2013,"Yes","Yes","Yes","No","Yes","Yes","Yes","No","Hpakan",3,20,"Yes","Nyein Chan Thar Yar IDP Committee","Saya Arr Si","09-47036678","Yes","No","No","Yes","No","No","No","No","Yes","Yes","Yes","Yes",1,2,3,5,2,7,10,11,21,30,35,65,17,17,34,32,27,59,42,35,77,8,6,14,145,135,280,1,0,1,0,0,0,0,0,0,1,0,1,0,0,0,0,0,0,0,6,6,6,8,1,2,3,2,0,2,61,280,79,337,18,57,"No","Yes",5,1,5,1,10,2,2,"Yes","Yes","Yes","Yes","Yes","No",null,0,null,0,1,1,1,"Individual","Yes","Solid shelters","51-75%","0%","Yes","Well","No",0,0,5,"No","Common identified waste dump inside camp","Rural sub-centre",null,"No","No","No","No","Yes","No","No","No","No","No","25-50%","25-50%","Mining","Other","Farming","Livestock","Other","None","Farming","Livestock","Basic Food                                       ","Basic Food                                       ","Medicines","Medicines","Well / water tank                          ","Well / water tank                          ","UNHCR"]
["D006","30/7/2013","UNHCR",null,"Enumerator from camp profiling  responsible organization",null,"15/6/2013","Camp Manager","Male",null,null,"Committee Member","Camp Resident","Male",null,null,"Kachin","Hpakant","Lone Khin","Lone Khin","AG Church, Hmaw Si Sa","MMR001CMP176",96.345569999999995,25.635300000000001,"Rural",1,2013,"Yes","Yes","Yes","No","Yes","Yes","Yes","No","Hpakan",3,20,"Yes","AG","Saya Arr Phee","09-6412972","Yes","No","No","Yes","No","No","No","No","Yes","Yes","Yes","Yes",1,1,2,9,3,12,5,6,0,41,27,68,39,22,61,53,60,113,26,19,45,10,6,16,184,144,328,1,0,1,0,0,0,2,0,2,2,0,2,0,0,0,0,0,0,0,10,10,0,5,0,5,5,0,0,0,66,328,1,5,4,20,"No","Yes",3,0,2,1,5,1,1,"Yes","Yes","Yes","Yes","Yes","No",1,0.25,1,0.5,0.5,0.5,1,"Individual","Yes","Solid shelters","96-100%","0%","No","Well","No",0,0,3,"No","Identified waste dump outside camp","Hospital",null,"No","No","No","No","No","No","No","No","No","Yes","96-100%","96-100%","None","None","Farming","Livestock","Mining","None","Farming","Livestock","Access to job opportunities        ","School materials / supplies                                         ","Individual shelter/houses             ","Well / water tank                          ","Cash/money assistance","Transport to school                     ","UNHCR"]
["D009","31/7/2013","UNHCR",null,"Enumerator from camp profiling  responsible organization",null,"13/6/2013","Camp Manager","Male",null,null,"Religious Leader","Camp Resident","Male",null,null,"Kachin","Hpakant","Lone Khin","Lone Khin","Muring Baptist Church, Awng Ra, Wa Ra Zut VT","MMR001CMP177",96.354159999999993,25.658670000000001,"Rural",1,2013,"Yes","Yes","Yes","No","Yes","Yes","Yes","No","Hpakan",6,30,"Yes","Mu Yin Baptist","Saya Kun Naung","09-42007516","Yes","Yes","No","No","No","No","No","No","Yes","No","No","Yes",1,0,1,0,1,1,1,2,3,1,2,3,0,2,2,2,0,2,3,3,6,2,2,4,10,12,22,1,0,1,0,0,0,0,0,0,0,0,0,0,0,0,0,0,0,0,0,0,0,1,1,0,1,0,0,0,6,22,0,0,4,18,"No","Yes",null,null,10,null,10,null,null,"No","No","No","No","Yes","No",0.5,0,0.5,0.125,0.125,0.25,0.25,"Individual","Yes","Solid shelters","0%","0%","Yes","Well","Yes",0,0,3,"Yes","Is getting burnt","Hospital",null,"No","No","No","No","No","No","No","No","No","Yes","96-100%","96-100%","Livestock","Mining","Farming","Trade (buying and selling)","Trade (buying and selling)","None","Farming","Livestock","Health facility / Clinic                                         ","Basic Food                                       ","Basic Food                                       ",null,null,null,"UNHCR"]
["D010","31/7/2013","KBC",null,"Other",null,"13/6/2013","Camp Manager","Male",null,null,"Religious Leader","Camp Resident","Male",null,null,"Kachin","Hpakant","Lone Khin","Lone Khin","5 Ward Baptist Church(lon Khin)","MMR001CMP179",96.355270000000004,25.656130000000001,"Rural",1,2013,"Yes","Yes","Yes","No","Yes","Yes","Yes","No","Hpakan",6,30,"Yes","Lone Khin Baptist","Saya Tu Lwan","09401535100, 096410561","Yes","No","Yes","No","No","No","Yes","No","No","Yes","Yes","Yes",7,3,10,7,10,17,12,15,27,67,70,137,44,50,94,19,59,78,35,79,114,5,20,25,196,306,502,3,2,5,1,0,1,1,4,5,2,0,2,0,0,0,0,0,0,0,0,0,4,7,0,0,0,0,0,0,133,502,220,847,70,210,"No","Yes",4,0,4,3,8,3,0,"Yes","Yes","Yes","No","Yes","No",0.5,0,0,0,null,null,0.5,"Communal","Yes","Solid shelters","96-100%","25-50%","No","Well","Yes",0,0,13,"Yes","Identified waste dump outside camp","Clinic",null,"No","Yes","Yes","No","No","No","No","No","No","No","76-95%","76-95%","Mining","None","Farming","Mining","Livestock","None","Farming","Livestock","Basic Food                                       ","Cash/money assistance","School facilities","Hygiene kits                                         ","School materials / supplies                                         ","Medicines"]
["H009","30/7/2013","KBSS/KMSS",null,"CCCM Focal Point",null,"16/1/2013","Camp Manager","Male",null,null,"Religious Leader","Camp Resident","Female",null,null,"Kachin","Hpakant","Seik Mu","Maw Shan","Lisu Baptist Church, Maw Shan Vil,. Seik Mu","MMR001CMP181",96.269199999999998,25.566510000000001,"Rural",1,2013,"Yes","Yes","Yes","No","Yes","Yes","Yes","No","Hpakan",9,20,"Yes","Lisu Baptist","U Thaung Wu","09-33048416","Yes","No","No","Yes","No","No","Yes","No","No","Yes","Yes","No",0,1,1,1,2,3,3,3,6,7,10,17,8,3,11,12,9,21,13,14,27,3,2,5,47,44,91,1,0,1,0,0,0,0,0,0,0,0,0,0,0,0,0,2,2,3,1,4,0,4,0,1,1,0,0,0,40,135,40,135,14,44,"No","Yes",0,0,3,0,0,0,3,"Yes","Yes","No","No","Yes","No",0.5,null,0.5,null,0.5,0.5,0.5,"Individual","Yes","Solid shelters","25-50%",null,"Yes","Other","No",0,0,0,"Yes","Common identified waste dump inside camp","Clinic",null,"No","No","No","Yes","Yes","No","No","No","Yes","No","51-75%","51-75%","Mining","None","Farming","Livestock","None","None","Farming","Livestock","Firewood / fuel                                                                      ","Medicines","Individual shelter/houses             ","Access to job opportunities        ","Well / water tank                          ","Cash/money assistance","KBC, UNHCR"]
["E015","31/7/2013","OTHER",null,"Other",null,"15/6/2013","Camp Manager","Male",null,null,"Committee Member",null,null,null,null,"Kachin","Hpakant","Seik Mu","Maw Shan","Rawan Baptist Church, Maw Shan Vil., Seik Mu","MMR001CMP182",96.279200000000003,25.56551,"Rural",1,2013,"Yes","Yes","Yes","No","Yes","Yes","Yes","No","Hpakant",3,20,"Yes","Committee Member","U Yin Ram","09-400011071","Yes","No","No","No","No","No","No","Yes","No","Yes","Yes ","Yes",0,0,0,1,1,2,0,5,5,2,5,7,0,2,2,2,4,6,4,6,10,2,0,2,11,23,34,0,0,0,0,0,0,0,0,0,0,0,0,0,0,0,0,0,0,0,1,1,0,2,0,0,0,0,0,0,9,34,9,34,0,0,"No","Yes",2,0,11,0,13,0,3,"No","No","No","No","No","No",null,null,null,null,null,null,null,"Mixed","No","Community/religious building","96-100%","96-100%","No","Well","No",0,0,0,"No","Identified waste dump outside camp","Clinic","No","No","No","No","No","No","No","No","No","No","Yes","96-100%","96-100%","Mining","Other","Farming","Mining","None","None","Farming","Other","Basic Food                                       ","Communal building                      ","Access to job opportunities        ","Complementary Food                                 ","Cash/money assistance","Firewood / fuel                                                                      ","UNHCR"]
["E012","31/7/2013","OTHER",null,"Other",null,"15/6/2013","Camp Manager","Male",null,null,"Committee Member",null,null,null,null,"Kachin","Hpakant","Seik Mu","Seik Mu","Sai Nai Baptish Church, Maw Shan Vil., Seki Mu","MMR001CMP183",96.353030000000004,25.668399999999998,"Rural",1,2013,"Yes","Yes","Yes","No","Yes","Yes","Yes","No","Hpakant",4,null,"Yes","Seng Ngai","U Seng Hkum","09-400006973","Yes","No","No","Yes","No","No","Yes","No","No","Yes","Yes ","Yes",3,4,7,0,3,3,6,3,9,11,1,1,5,9,14,23,18,41,15,18,33,1,1,2,64,57,121,1,1,2,3,0,3,0,0,0,0,0,0,0,0,0,0,0,0,0,0,0,1,10,1,0,1,2,0,2,0,0,0,0,10,null,"Yes","Yes",null,1,4,1,4,2,1,"No","No","No","No","No","No",null,null,null,null,null,null,null,"Individual","Yes","Solid shelters","76-95%","less than 25%","No","Rivers, springs, etc.","No",0,0,0,"No","Common identified waste dump inside camp","Clinic",null,"No","No","No","Yes","No","No","No","Yes","No","No","76-95%","76-95%","Farming","Trade (buying and selling)","Livestock","Trade (buying and selling)","Farming","None","Farming","Other","Basic Food                                       ","Basic Food                                       ","Health facility / Clinic                                         ","Health facility / Clinic                                         ","Access to job opportunities        ","Access to job opportunities        "]
["D005","30/7/2013","UNHCR",null,"Enumerator from camp profiling  responsible organization",null,"13/6/2013","Camp Manager","Male",null,null,"FBO/NGO Staff","Camp Resident","Female",null,null,"Kachin","Hpakant","Seik Mu","Sai Taung (Ywar Haung)","Ward 2 Sai Taung Baptist Church, Seik Mu ","MMR001CMP184",96.286680000000004,25.577559999999998,"Rural",1,2013,"Yes","Yes","Yes","No","Yes","Yes","Yes","No","Hpakan",3,10,"Yes","KBC","U Tain Bawn","09-400030035","Yes","Yes","No","No","No","No","No","No","Yes","No","Yes","Yes",3,5,8,4,5,9,23,18,41,35,39,74,36,26,62,23,46,69,47,50,97,6,5,11,177,194,371,0,1,1,0,2,2,3,1,4,0,0,0,0,0,0,0,0,0,7,9,16,2,12,6,0,6,1,0,1,100,371,144,520,44,149,"No","Yes",0,0,6,3,6,3,1,"Yes","No","No","No","Yes","No",0.125,4,0,0,0.125,0.125,0.125,"Communal","Yes","Community/religious building","96-100%","0%","No","Rivers, springs, etc.","Yes",0,0,15,"No","Common identified waste dump inside camp","Clinic",null,"No","Yes","No","No","No","No","No","No","No","No","96-100%","96-100%","None","None","Farming","Livestock","None","None","Farming","Livestock","Well / water tank                          ","Individual shelter/houses             ","School materials / supplies                                         ","Communal building                      ","Firewood / fuel                                                                      ","Medicines","UNHCR"]
["F014","31/7/2013","KBSS/KMSS",null,"Enumerator from camp profiling  responsible organization",null,"14/6/2013","Camp Manager","Male",null,null,"Religious Leader","Camp Resident","Female",null,null,"Kachin","Hpakant","Seik Mu","Seik Mu","Ward 2 Cahotlic Church, Seik Mu","MMR001CMP185",96.288250000000005,25.57921,"Rural",1,2013,"Yes","Yes","Yes","No","Yes","Yes","Yes","No","Hpakan",2,null,"Yes","RC Relif Committee","Saya Nwa  Gam Seng","09-47055565","Yes","No","No","Yes","No","No","No","Yes","No","Yes","Yes","Yes",0,1,1,2,0,2,1,0,1,13,10,23,11,15,26,6,10,16,15,15,30,4,2,6,52,53,105,0,0,0,1,0,1,0,1,1,0,0,0,0,0,0,0,0,0,0,0,0,0,1,0,0,0,0,0,0,26,105,0,0,null,null,"No","Yes",2,2,4,3,6,5,1,"Yes","Yes","Yes","Yes","Yes","No",null,null,null,null,null,null,null,"Mixed","Yes","Community/religious building","25-50%","0%","No","Other","No",0,0,0,"No","Identified waste dump outside camp","Clinic",null,"No","No","No","No","No","No","No","No","No","Yes","76-95%","76-95%","Mining","None","Farming","Mining","None","None","Farming","Trade (buying and selling)","Cash/money assistance","Cash/money assistance","Well / water tank                          ","Well / water tank                          ","Medicines","Vocational training                       "]
["D001","30/7/2013","OTHER",null,"Other",null,"18/6/2013","Camp Manager","Male",null,null,"Committee Member","Camp Resident","Female",null,null,"Kachin","Hpakant","Urban","Maw Wan","AG Church, Maw Wan","MMR001CMP190",96.317350000000005,25.616509000000001,"Urban",1,2013,"No","Yes","Yes","No","No","Yes","Yes","No","Hpakan",0.5,15,"Yes","AG","Saya Yaw Han","094711241","Yes","No","No","Yes","No","No","No","No","Yes","Yes","No","No",2,2,4,3,3,6,6,3,9,9,4,13,7,7,14,12,4,16,11,11,22,3,4,7,53,38,91,0,0,0,0,0,0,0,0,0,0,0,0,0,0,0,0,0,0,0,1,1,1,3,0,4,4,0,0,0,18,91,0,0,null,null,"No","No",null,null,null,null,null,null,null,"No","No","No","No","No","No",null,null,null,null,null,null,null,"Individual","Yes","Solid shelters","25-50%","less than 25%","Yes","Well","No",2,2,0,"No","Identified waste dump outside camp","Hospital",null,"No","No","No","No","No","No","No","No","No","No","96-100%","96-100%","Mining","None","Farming","Livestock","Other","None","Livestock","None","Cash/money assistance","Cash/money assistance","Firewood / fuel                                                                      ","Medicines","Complementary Food                                 ","Individual shelter/houses             ","UNHCR"]
["H010","30/7/2013","UNHCR",null,"CCCM Focal Point",null,"14/6/2013","Camp Manager","Male",null,null,"Committee Member","Camp Resident","Female",null,null,"Kachin","Hpakant","Seik Mu","Maw Shan","Hmaw Wan, Anglican","MMR001CMP191",96.317350000000005,25.616509000000001,"Rural",8,2012,"Yes","Yes","Yes","No","Yes","Yes","Yes","No","Hpakan",0.5,3,"Yes","Hmaw Wan, Anglican","U Naw San","09-403743873","Yes","Yes","No","No","No","No","Yes","Yes","No","Yes","Yes","Yes",0,0,0,3,4,7,3,2,5,8,6,14,3,3,6,9,10,19,4,5,9,3,1,4,33,31,64,0,1,1,0,0,0,0,0,0,0,0,0,0,0,0,0,0,0,0,1,1,0,1,0,1,1,0,0,0,13,64,13,64,15,85,"No","No",0,0,0,0,0,0,0,"No","No","No","No","No","No",8,null,8,null,0.25,0.25,0.25,"Individual","Yes","Community/religious building","96-100%","0%","Yes","Well","Yes",0,0,5,"No","Identified waste dump outside camp","Hospital",null,"Yes","No","No","No","No","No","No","No","No","Yes","96-100%","96-100%","Mining","None","Farming","Mining","None","None","Livestock","Manufacturing (non-food)","Basic Food                                       ","Cash/money assistance","Health facility / Clinic                                         ","School materials / supplies                                         ","Health facility / Clinic                                         ","Access to job opportunities        "]
["E011","31/7/2013","OTHER",null,"Other",null,"//","Camp Manager","Male",null,null,"Committee Member",null,null,null,null,"Kachin","Hpakant","Nam Ma Hpyit","Nam Ma Hpyit","Association of Christ, Nam Ma Phyit","MMR001CMP192",96.339590000000001,25.617998,null,1,2013,"Yes","Yes","Yes","No","Yes","Yes","Yes","No","Hpakant",null,40,"Yes","KMSS","U Thein Naing","09-47011093","Yes","No","No","No","No","No","No","No","Yes","No","No","No",1,0,1,6,1,7,2,1,3,5,6,11,4,6,10,11,12,23,17,9,26,2,5,7,48,40,88,0,0,0,0,0,0,0,0,0,0,0,0,3,1,4,0,0,0,1,3,4,1,3,0,0,0,0,0,0,27,88,103,30,3,15,"No","Yes",4,0,5,0,9,0,0,"No","No","No","No","No","No",null,null,null,null,null,null,null,"Communal","Yes","Solid shelters","51-75%","less than 25%","No","Well","Yes",1,1,0,"No","Common identified waste dump inside camp","Hospital",null,"No","No","No","No","No","No","No","No","No","No","0%","less than 25%","Mining","None","Farming","Mining","None","Livestock","Farming","Livestock",null,null,null,null,null,null,"UNHCR"]
["A001","30/7/2013","UNHCR",null,"CCCM Focal Point",null,"14/6/2013","Camp Manager","Female",null,null,"Religious Leader",null,null,null,null,"Kachin","Bhamo","Aung Thar","Aung Thar","Aung Thar Church","MMR001CMP194",97.252650000000003,24.260466999999998,"Urban",9,2011,"No","Yes","Yes","No","No","Yes","Yes","No","Bhamo",2,null,"Yes","KBC","Sayama Htoi Bu",7451262,"Yes","Yes","No","No","No","No","Yes ","No","No","Yes","Yes","Yes",0,0,0,1,0,1,2,2,4,2,4,6,2,4,6,2,5,7,2,1,3,4,6,10,15,22,37,0,0,0,0,0,0,0,1,1,0,0,0,1,1,2,0,0,0,1,0,1,1,1,0,0,0,0,0,0,10,33,0,0,null,2,"No","Yes",0,0,5,3,5,3,1,"No","No","No","No","Yes","No",null,null,null,null,null,null,null,"Individual","Yes","Community/religious building","0%","0%","Yes","Borehole/hand pump","Yes",1,1,0,"No","Common identified waste dump inside camp","Clinic",null,"No","Yes","No","No","No","No","No","No","No","No","96-100%","96-100%","Farming","Handicrafts","Farming","Livestock","Livestock","Other","Farming","Livestock","Firewood / fuel                                                                      ","Cash/money assistance","Medicines","Vocational training                       ","Complementary Food                                 ","Hygiene kits                                         "]
["F005","30/7/2013","SHALOM",null,"CCCM Focal Point",null,"21/7/2013","Camp Manager","Male",null,null,"Committee Member",null,null,null,null,"Kachin","Chipwi","Urban","Rit Law","Lhaovao Baptist Church (LBC)","MMR001CMP195",null,null,null,2,2012,"Yes","Yes","Yes","No","Yes","Yes","Yes","No","Chipwi",null,5,"Yes","Shalom","U D Ze Dai",null,"Yes","No","No","Yes","No","No","Yes","No","No","Yes","Yes","Yes",1,3,4,20,9,29,19,5,24,28,8,36,40,37,77,52,50,102,60,64,124,55,60,115,275,236,511,0,2,2,0,1,1,6,7,13,0,0,0,0,0,0,0,0,0,0,0,0,4,2,2,2,4,0,0,0,138,517,138,517,0,0,"No","Yes",5,1,6,3,11,4,1,"Yes","Yes","No","No","Yes","No",null,null,null,null,null,null,null,"Individual","Yes","Solid shelters","0%","51-75%","Yes","Rivers, springs, etc.","Yes",10,10,0,"No","Common identified waste dump inside camp","Hospital",null,"No","Yes","No","No","No","No","No","No","No","No","51-75%","25-50%","Other","None","Farming",null,"Other","None","Farming",null,"Basic Food                                       ","Kitchen sets                                         ","Individual shelter/houses             ","Bathing spaces                                      ","Medicines","Vocational training                       ","UNHCR","Shalom, UNHCR, DRC"]
["I003","30/7/2013","KBSS/KMSS",null,"CCCM Focal Point",null,"21/6/2013","Camp Manager","Male",null,null,"Committee Member",null,null,null,null,"Kachin","Mansi","Man Mawn","Man Mawn","Lagatyan ","MMR001CMP202",97.613699999999994,23.879899999999999,"Rural",4,2013,"Yes","Yes","Yes","No","Yes","Yes","No","No","Nam Hkam",10,45,"Yes","LSO/KMSS","Sr. Lahpai Naw Naw",15208801800,"Yes","No","Yes","No","No","No","Yes","No","No","Yes","Yes","Yes",3,3,6,5,15,20,26,29,55,53,46,99,20,25,45,45,64,109,35,52,87,13,10,23,200,244,444,1,1,2,0,0,0,0,0,0,1,0,1,3,6,9,0,1,1,0,0,0,15,30,0,1,1,0,0,0,114,444,114,444,0,0,"No","Yes",7,4,0,0,7,4,0,"Yes","No","No","No","No","No",1,null,null,null,null,null,null,"Individual","No","Solid shelters","51-75%","0%","Yes","Rivers, springs, etc.","No",5,5,0,"No","Common identified waste dump inside camp","Clinic",null,"No","Yes","No","No","No","No","No","No","No","No","51-75%","51-75%","Farming","None","Farming","Livestock","Farming","None","Farming","Livestock","Basic Food                                       ",null,"Firewood / fuel                                                                      ",null,"Well / water tank                          "]
["E005","30/7/2013","KBSS/KMSS",null,"CCCM Focal Point",null,"18/6/2013","Camp Manager","Male",null,null,null,null,null,null,null,"Kachin","Mansi","Mung Ding Pa","Mung Ding Pa","Mung Ding Pa  (Boarder)","MMR001CMP203",96.808850000000007,24.20645,"Rural",7,2012,"Yes","Yes","Yes","No","Yes","Yes","Yes","No","Man Si",24,null,"Yes","IRRC/KMSS","Mr.Hka Aung","09-91039627","Yes","Yes","No","No","No","No","No","No","Yes","No","Yes","No",0,0,0,0,0,0,0,0,0,105,93,198,98,104,202,0,0,0,0,0,0,0,0,0,203,197,400,0,0,0,0,0,0,0,0,0,0,0,0,0,0,0,0,0,0,0,0,0,0,0,0,0,0,0,0,0,98,400,0,0,null,null,"No","Yes",null,null,4,3,4,3,1,"Yes","No","No","No","No","No",null,null,null,null,null,null,null,"Communal","No","Solid shelters","0%","0%","Yes","Rivers, springs, etc.","Yes",7,7,7,"Yes","Is getting burnt","Rural centre",null,"No","Yes","Yes","Yes","Yes","Yes","Yes","Yes","Yes","No","0%","0%","None","None","None",null,"None","None","None",null,"Complementary Food                                 ","Women NFIs (sanitary pads, underwear, etc.)","Blankets/Winter Clothing                                         ","Firewood / fuel                                                                      ","Well / water tank                          ","Health facility / Clinic                                         "]
["E004","30/7/2013","KBSS/KMSS",null,"CCCM Focal Point",null,"16/6/2013","Camp Manager","Female",null,null,null,null,null,null,null,"Kachin","Mansi","Nam Lin Pa","Nam Lin Pa","Nam Lim Pa    (Boarder)","MMR001CMP204",96.808940000000007,24.20635,"Rural",7,2012,"Yes","Yes","Yes","Yes","Yes","Yes","No","No","Man Si",34,34,"Yes","IRRC/KMSS","Pan Htoi Aung","09-91039627","Yes","Yes","No","No","No","No","Yes","No","No","No","Yes","No",10,15,25,31,34,65,36,40,76,193,202,395,133,150,283,67,73,140,39,46,85,33,42,75,542,602,1144,0,2,2,4,5,9,0,3,3,0,0,0,0,0,0,1,1,2,5,22,27,7,19,0,2,2,0,2,2,185,1144,0,0,null,null,"No","Yes",2,null,5,2,7,2,1,"Yes","No","No","No","No","No",null,null,null,null,null,null,null,"Individual","Yes","Solid shelters","0%","0%","Yes","Rivers, springs, etc.","No",0,0,0,"No","Is getting burnt","Rural centre",null,"Yes","Yes","Yes","No","Yes","Yes ","No","Yes","No","No","25-50%","25-50%","Farming","Other","Farming","Other","None","None","Farming","Other","Cash/money assistance","Complementary Food                                 ","Access to job opportunities        ","School materials / supplies                                         ","Bathing spaces                                      ","Kitchen sets                                         "]
["F002","30/7/2013","OTHER",null,"Other","Church","26/6/2013","Other","Male",null,null,"Other",null,null,null,null,"Shan (North)","Hseni","Nar Tee","Nar Tee","Narte","MMR015CMP207",98.129440000000002,23.211770000000001,"Rural",4,2013,"Yes","Yes","Yes","No","Yes","Yes","Yes","No","Theinni",50,120,"Yes","Church","U Lawng Li","09-47235046","Yes","No","No","Yes","No","No","Yes","No","No","No","No","No",1,0,1,6,3,9,12,20,32,18,17,35,23,18,41,24,24,48,34,30,64,10,18,28,128,130,258,0,0,0,0,0,0,0,2,2,0,0,0,0,0,0,1,1,2,0,0,0,3,6,0,0,0,0,0,0,50,258,55,273,1,4]
["G005","30/7/2013","KBC",null,"CCCM Focal Point",null,"20/6/2013","Camp Manager","Male",null,null,"Committee Member","Camp Resident","Female",null,null,"Shan (North)","Namhkan","Urban","Aung Metta","Nam Hkam (KBC Jaw Wang)","MMR015CMP001",97.683499999999995,23.831700000000001,"Urban",12,2011,"Yes","Yes","Yes","Yes","Yes","Yes","Yes","Yes","Nam Hkam",1,30,"Yes","KBC","Brang San Aung",18288183074,"Yes","No","Yes","No","No","No","No","Yes","No","Yes","Yes","Yes",0,2,0,6,8,0,12,8,0,49,53,0,31,41,0,29,47,0,39,44,0,8,18,0,174,221,395,2,2,4,0,0,0,0,4,4,0,1,1,1,1,2,1,4,5,1,3,4,2,8,0,2,2,0,0,0,84,390,2,13,11,54,"Yes","Yes",3,4,4,3,7,7,2,"Yes","Yes","Yes","Yes","Yes","No",1,null,null,null,1,1,1,"Communal","Yes","Solid shelters","76-95%","0%","No","Borehole/hand pump","Yes",3,3,0,"Yes","Identified waste dump outside camp","Hospital",null,"No","Yes","No","No","No","No","No","No","No","No","96-100%","96-100%","Other","None","Farming","Livestock","Other","None","Farming","Livestock","Kitchen sets                                         ","Access to job opportunities        ","Firewood / fuel                                                                      ","Vocational training                       ","Transport to school                     ","Cash/money assistance","KBC, UNHCR","KBC, UNHCR, DRC"]
["I002","30/7/2013","KBSS/KMSS",null,"CCCM Focal Point",null,"21/6/2013","Camp Resident","Female",null,null,"Committee Member",null,null,null,null,"Shan (North)","Namhkan","Urban",null,"Nam Hkam Catholic Church ( St. Thomas I)","MMR015CMP003",97.685199999999995,23.833100000000002,"Urban",12,2011,"Yes","Yes","Yes","No","No","No","No","No","Man Si",null,30,"Yes","LSO/KMSS","Tsaru Mi Nar","09-444025437","Yes","Yes","No","No","No","No","No","Yes","No","No","Yes","Yes",1,4,5,10,7,17,15,17,32,47,37,84,17,16,33,15,34,49,16,27,43,4,8,12,125,150,275,1,1,2,0,0,0,1,0,1,1,1,2,2,0,2,0,0,0,1,2,3,4,12,3,0,3,0,0,0,66,275,0,0,25,112,"No","Yes",4,1,null,null,4,1,4,"Yes","No","No","Yes","No","No",null,null,null,null,null,null,null,"Communal","Yes","Solid shelters","0%","0%","No","Well","Yes",3,3,3,"Yes","Identified waste dump outside camp","Hospital",null,"No","No","No","Yes","Yes","No","Yes","No","No","No","96-100%","96-100%","Other","None","Farming","Livestock","Other","None","Farming","Livestock"]
["G004","30/7/2013","KBC",null,"CCCM Focal Point",null,"20/6/2013","Camp Manager","Male",null,null,null,"Camp Manager","Male",null,null,"Shan (North)","Namhkan","Urban","Aung Metta","Nam Hkam - Nay Win Ni (Palawng)","MMR015CMP004",97.6892,23.833600000000001,"Urban",12,2013,"Yes","Yes","Yes","Yes","Yes","Yes","Yes","Yes","Nam Hkam",1,30,"Yes","Ta Aung Literature and Cultural Association","U San Aye",13887877445,"Yes","No","No","Yes","No","No","No","Yes","No","Yes","Yes","Yes",5,3,0,7,8,0,17,12,0,33,25,0,28,15,0,35,30,0,39,30,0,8,7,0,172,130,302,1,0,1,0,1,1,4,0,4,2,2,4,0,0,0,0,0,0,2,10,12,5,12,3,3,6,0,0,0,78,302,0,0,16,76,"No","Yes",5,2,2,0,7,2,5,"Yes","Yes","No","No","No","No",1,3,1,0,1,2,2,"Mixed","Yes","Solid shelters","less than 25%","less than 25%","No","Other","No",0,0,0,"Yes","Is getting burnt","Hospital",null,"No","Yes","No","No","No","No","No","No","No","No","25-50%","25-50%","Farming","Other","Farming","Other","Farming","Other","Farming","Other","Firewood / fuel                                                                      ","Partitions within shelters","Hygiene kits                                         ","Hygiene kits                                         ","Medicines","Firewood / fuel                                                                      ","KBC, UNHCR","KBC, UNHCR, DRC"]
["A008","30/7/2013","UNHCR",null,null,null,"25/6/2013","Camp Manager","Male",null,null,null,null,null,null,null,"Shan (North)","Kutkai","Mong See Wein Mai (Tarmoenye Sub-township)","Mai Pong (Shu See)","Mungji Pa Dabang (Baptist Church)         ","MMR015CMP006",98.220614999999995,23.400155999999999,"Rural",9,2011,"Yes","Yes","Yes","No","Yes","Yes","Yes","No","Kutkai",44,150,"Yes","KBC ","Rev. U Tang Nai","09-47325022","Yes","Yes","No","No","No","No","No","No","Yes","Yes","Yes","Yes",6,4,10,5,5,10,17,14,31,26,33,59,25,15,40,19,24,43,25,17,42,7,9,16,130,121,251,1,0,1,0,0,0,4,3,7,1,1,2,0,0,0,7,14,21,1,1,2,5,17,0,0,0,0,0,0,47,260,0,0,null,null,"No","Yes",0,0,4,3,0,0,2,"No","No","No","No","Yes","No",null,0.25,1,null,null,0.1875,0.1875,null,"No","Community/religious building","96-100%",null,null,"Rivers, springs, etc.","No",0,0,0,"No","Common identified waste dump inside camp","Rural centre",null,"No","No","Yes","No","No","No","No","No","No","No","76-95%","76-95%","Farming","None","Farming","None","Farming","None","Farming","None","Individual shelter/houses             ",null,"Other",null,"Communal building                      ",null,"KBC, UNHCR"]
["G002","30/7/2013","UNHCR",null,"Enumerator from camp profiling  responsible organization",null,"23/6/2013","Camp Manager","Female",null,null,"Committee Member","Camp Manager","Female",null,null,"Shan (North)","Kutkai","Nam Hpat Kar","Nam Hpat Kar (Ho Pon + Pang Sa Lorp)","Nam Hpak Ka Mare ","MMR015CMP007",97.490750000000006,23.413948999999999,"Rural",12,2011,"Yes","Yes","Yes","No","Yes","Yes","Yes","No","Kutkai",27,120,"Yes","Nam Hpa Ka KBC","Z Bawk Tauwng","082-67049 , 082-67046","Yes","No","No","Yes","No","No","No","No","Yes","No","Yes","Yes",0,1,0,0,2,0,16,21,0,48,51,0,15,19,0,3,40,0,30,88,0,9,5,0,121,227,348,2,1,3,0,2,2,0,0,0,7,15,22,0,0,0,1,2,3,0,5,5,7,1,0,1,1,0,0,0,79,276,3,11,2,8,"No","Yes",1,2,5,3,6,5,1,"Yes","No","Yes","No","No","No",0.25,0.5,0.25,0.3,0.3,0.5,0.5,"Individual","No","Solid shelters","76-95%","less than 25%",null,"Rivers, springs, etc.","No",0,0,4,"No","Common identified waste dump inside camp","Hospital",null,"No","No","Yes","No","Yes","Yes","No","No","Yes","No","51-75%","51-75%","Farming","Other","Farming","Livestock","Manufacturing (non-food)","Other","Farming","Livestock","Cash/money assistance",null,"Individual shelter/houses             ",null,"School materials / supplies                                         ",null,"KBC, UNHCR","Shalom, DRC"]
["F003","30/7/2013","OTHER","Youth","CCCM Focal Point",null,"28/6/2013","Camp Manager","Male",null,null,"Committee Member",null,null,null,null,"Shan (North)","Manton","Urban","Ward (2)","Mandung - Jinghpaw","MMR015CMP009",null,null,"Urban",4,2012,"Yes","Yes","Yes","No","Yes","Yes","Yes","No","Manton",0.25,15,"Yes","IDP Committee","Rev. Nan Jung","09-47312039","Yes","No","No","Yes","No","No","No","Yes","No","No","Yes","Yes",0,0,0,5,3,8,3,7,10,20,13,33,14,15,29,16,25,41,18,27,45,7,10,17,83,100,183,0,2,2,1,0,1,0,1,1,0,0,0,1,2,3,0,0,0,1,2,3,2,5,0,0,0,1,0,1,43,183,3,11,0,0,"No","Yes",5,2,17,3,22,5,0,"Yes","Yes","No","No","Yes","No",0.25,null,0.25,0.125,null,0.125,0.125,"Individual","Yes","Solid shelters","76-95%","0%","Yes","Rivers, springs, etc.","No",0,0,0,"No","Common identified waste dump inside camp","Hospital",null,"Yes","Yes","Yes","No","Yes","No","No","No","No","No","96-100%","76-95%","Farming","Livestock","Farming","Livestock","Farming","Livestock","Farming","Livestock","School facilities","Vocational training                       ","School materials / supplies                                         ","Medicines","Access to job opportunities        ","Medical staff (doctor, nurse, etc)","KBC, UNHCR","KBC, UNHCR"]
["G003","30/7/2013","UNHCR",null,"Enumerator from camp profiling  responsible organization",null,"22/6/2013","Camp Manager","Male",null,null,"Committee Member",null,null,null,null,"Shan (North)","Muse","Man Gyat (Monekoe Sub-township)","Gwum Hsan","Munekoe Pa (Giwang) - Hka San (Mung  Go  Pa ) ","MMR015CMP012",null,null,"Urban",7,2012,"Yes","Yes","Yes","No","Yes","Yes","Yes","No","Mung Gu",0.25,3,"Yes","Mung Gu KBC","Galau Thing Nan","147873309 9 2","Yes","No","No","Yes","No","No","No","No","Yes","No","Yes","Yes",6,0,0,1,4,0,6,6,0,10,17,0,4,5,0,4,10,0,6,15,0,2,3,0,39,60,99,0,1,1,1,0,1,1,2,3,0,0,0,0,0,0,0,0,0,0,6,6,2,3,6,0,6,1,1,2,27,99,0,0,0,0,"No","Yes",3,0,7,1,10,1,2,"Yes","Yes","Yes","Yes","Yes","No",0.25,null,0.75,null,0.25,2,2,"Communal","Yes","Community/religious building","96-100%","0%",null,"Rivers, springs, etc.","No",3,2,0,"Yes","Identified waste dump outside camp","Hospital",null,"No","Yes","Yes","No","No","No","No","No","No","No","96-100%","96-100%","Farming","Livestock","Farming","Livestock","Farming","Livestock","Farming","Livestock","Kitchen sets                                         ","Individual shelter/houses             ","Basic Food                                       ","Basic Food                                       ","Firewood / fuel                                                                      ",null,"KBC, UNHCR"]
["F001","30/7/2013","OTHER","Youth","CCCM Focal Point",null,"27/6/2013","Camp Manager","Male",null,null,"Committee Member",null,null,null,null,"Shan (North)","Namtu","Urban","Ward (7)","Nam Tu Baptist","MMR015CMP014",null,null,"Urban",4,2012,"Yes","Yes","Yes","No","Yes","Yes","Yes","No","Namtu",0.25,15,"Yes","IDP Committee","U Brang Mai","09-49150147","Yes","No","No","Yes","No","No","No","Yes","No","No","Yes","Yes",0,0,0,4,1,5,6,7,13,9,11,20,1,6,7,2,8,10,3,6,9,1,1,2,26,40,66,0,1,1,0,0,0,0,0,0,0,0,0,0,0,0,0,0,0,0,0,0,0,8,0,0,0,0,0,0,16,66,1,4,1,8,"No","Yes",1,1,9,1,10,2,2,"Yes","Yes","No","No","No","No",0.25,null,0.25,null,null,0.5,0.5,"Individual","Yes","Solid shelters","96-100%","0%","Yes","Rivers, springs, etc.","No",2,2,0,"No","Identified waste dump outside camp","Hospital",null,"No","Yes","Yes","No","Yes","No","No","No","No","No","96-100%","96-100%","Farming","Other","Farming","Livestock","Farming","Livestock","Farming","Livestock","Well / water tank                          ","Well / water tank                          ","Cash/money assistance","Vocational training                       ","Medicines","Cash/money assistance","UNHCR","KBC, UNHCR"]
["A009","30/7/2013","UNHCR",null,"Other",null,"26/6/2013","Camp Manager","Male",null,null,"Teacher",null,null,null,null,"Shan (North)","Kutkai","Kar Lai Kone Hsar","Kar Lai","Kone Khem Camp","MMR015CMP015",null,null,"Rural",1,2013,"Yes","Yes","Yes","No","No","No","No","No","Kutkai",7,120,"Yes","U Tun Hkam","U Kin Dar Wa Ya",null,"Yes","No","Yes","No","No","No","No","No","Yes","No","Yes","Yes",4,8,12,12,11,23,18,18,36,44,39,83,43,23,66,58,61,119,38,50,88,13,13,26,230,223,453,0,0,0,0,0,0,0,0,0,0,0,0,0,0,0,0,0,0,0,0,0,5,7,1,2,3,2,2,4,86,453,86,453,86,453,"No","Yes",3,2,1,0,4,2,0,"Yes","Yes","No","Yes","Yes","No",null,null,null,null,null,null,null,"Individual","No","Solid shelters","76-95%","less than 25%","No","Rivers, springs, etc.","yes",10,10,0,"No","Is getting burnt","Clinic",null,"No","yes","No","No","yes","No","No","No","No","No","51-75%","25-50%","Farming","Other","Farming","None","Farming","None","Farming","Other","Individual shelter/houses             ","Individual shelter/houses             ","Well / water tank                          ","Basic Food                                       ","Cash/money assistance","Cash/money assistance"]
["G001","30/7/2013","KBC",null,"Other","KBC","24/6/2013","Camp Manager","Male",null,null,"Religious Leader","Camp Resident","Male",null,null,"Shan (North)","Kutkai","Urban","Ward(5)","Kutkai downtown (KBC Church)","MMR015CMP016",97.554308000000006,23.271719000000001,"Urban",12,2012,"Yes","Yes","Yes","No","Yes","Yes","Yes","No","Kutkai",0,0,"Yes","Kutkai KBC","U Naw San Aung","09 -403711789","Yes","No","No","No","No","No","No","Yes","No","Yes","Yes","Yes",4,1,0,19,17,0,8,9,0,76,66,0,32,22,0,14,43,0,17,35,0,1,18,0,171,211,382,3,0,3,0,0,0,2,5,7,12,18,30,0,0,0,0,2,2,2,2,4,6,24,2,2,4,1,1,2,87,382,87,382,17,68,"No","Yes",2,2,5,3,7,5,1,"Yes","Yes","Yes","No","Yes","No",null,null,null,null,null,null,null,"Individual","Yes","Solid shelters","0%","0%","Yes","Well","Yes",4,5,0,"No","Is getting burnt","Hospital",null,"Yes","Yes","No","No","Yes","No","Yes","No","Yes","No","76-95%","51-75%","Farming","Other","Farming","Other","Farming","Other","Farming","Other","Firewood / fuel                                                                      ","Cash/money assistance","Cash/money assistance","Firewood / fuel                                                                      ","Complementary Food                                 ","Access to job opportunities        ","KBC, UNHCR"]
["B006","30/7/2013","UNHCR",null,"Enumerator from camp profiling  responsible organization",null,"24/6/2013","Camp Manager","Male",null,null,"Religious Leader","Camp Resident","Female",null,null,"Shan (North)","Kutkai","Urban","Ward - 3","Kutkai downtown (RC Church)","MMR015CMP017",97.565616000000006,23.273361000000001,"Urban",12,2012,"Yes","Yes","Yes","No","Yes","Yes","Yes","No","Kutkai",null,null,"Yes","Kutkai CRC","U Naung Latt","082-62251","Yes","Yes","No","No","No","No","Yes","No","No","Yes","Yes","Yes",3,1,4,3,6,9,9,10,19,19,22,41,10,9,19,9,19,28,17,17,34,8,10,18,78,94,172,0,1,1,0,0,0,1,1,2,0,0,0,0,0,0,1,2,3,2,0,2,5,4,3,2,5,0,1,1,41,172,0,20,7,0,"Yes","Yes",5,2,0,0,5,2,0,"Yes","Yes","Yes","Yes","Yes","No",1,null,null,null,null,null,null,"Individual","No","Solid shelters","0%","0%","Yes","Rivers, springs, etc.","Yes",5,5,0,"No","Common identified waste dump inside camp","Hospital",null,"No","Yes","Yes","No","Yes","Yes","Yes","No","No","No","51-75%","76-95%","Farming","Manufacturing (non-food)","Farming","Livestock","Farming","None","Farming","Livestock","Firewood / fuel                                                                      ","Kitchen sets                                         ","Vocational training                       ","Firewood / fuel                                                                      ","Bathing spaces                                      "]
["A006","30/7/2013","KBC",null,"Other",null,"22/6/2013","Camp Manager","Male",null,null,"Committee Member","Camp Resident","Male",null,null,"Shan (North)","Kutkai","Mong Yu","Mong Yu","Mine Yu Lay village","MMR015CMP018",97.474305999999999,23.352518,"Rural",1,2013,"Yes","Yes","Yes","No","Yes","Yes","Yes","No","Kutkai",20,60,"Yes","Committee","U Chyan Sar","09-47318890","Yes","Yes","No","No","No","No","No","No","Yes","Yes","Yes","Yes",2,4,6,16,20,36,11,12,23,27,41,68,37,31,68,45,55,100,27,40,67,3,5,8,168,208,376,2,1,3,0,0,0,2,0,2,0,0,0,4,5,9,0,0,0,0,8,8,4,19,0,4,4,0,0,0,59,378,0,0,null,null,"No","Yes",6,0,5,2,11,2,0,"Yes","Yes","Yes","No","Yes","No",null,null,null,null,null,null,null,"Individual","No","Solid shelters","less than 25%","0%","No","Rivers, springs, etc.","No",0,0,18,"No","Is getting burnt","Clinic",null,"No","No","Yes","No","Yes","No","No","No","No","No","51-75%","25-50%","Farming","Other","Farming","Other","Farming","Other","Farming","Livestock","Communal building                      ","Cash/money assistance","Well / water tank                          ","Firewood / fuel                                                                      ","Complementary Food                                 ","Kitchen sets                                         "]
["A010","30/7/2013","UNHCR",null,"Enumerator from camp profiling  responsible organization",null,"25/6/2013","Camp Manager",null,null,null,null,null,null,null,null,"Shan (North)","Kutkai","Mong See Wein Mai (Tarmoenye Sub-township)","Mai Pong (Shu See)","Mungji Pa Dabang (RC Church)         ","MMR015CMP019",97.565616000000006,23.273361000000001,"Rural",9,2011,"Yes","Yes","Yes","No","Yes","Yes","Yes","No","Kutkai",44,150,"Yes","Committee","Sara Seng Hkum",null,"Yes","Yes","No","No","No","No","No","No","Yes","Yes","Yes","Yes",0,0,0,0,0,0,0,0,0,0,0,0,0,0,0,0,0,0,0,0,0,0,0,0,0,0,0,0,0,0,0,0,0,0,0,0,0,0,0,0,0,0,0,0,0,0,0,0,0,0,0,0,0,0,0,0,17,80,0,0]
["A007","30/7/2013",null,null,null,null,"24/6/2013","Camp Manager","Male",null,null,"Other",null,null,null,null,"Shan (North)","Kutkai","Kar Lai Kone Hsar","Kar Lai","Zup Aung Camp","MMR015CMP020",null,null,"Rural",12,2012,"Yes","Yes","Yes","No","No","No","No","No","Kutkai",8,125,"Yes","Committee","U La Nu",null,"Yes","No","No","No","No","No","No","No","Yes","Yes","Yes","Yes",0,0,0,5,20,25,14,18,32,25,29,54,33,28,61,70,43,113,30,36,66,15,14,29,192,188,380,0,2,2,0,0,0,3,1,4,0,0,0,0,0,0,0,0,0,0,0,0,4,12,0,0,0,0,0,0,75,380,75,380,0,0,"No","Yes",6,1,9,0,15,1,0,"Yes","Yes","No","No","Yes","No",null,null,null,null,null,null,8,"Individual","No","Solid shelters","0%","0%","No","Rivers, springs, etc.","No",0,0,75,"No","Is getting burnt","Clinic",null,"No","No","No","No","Yes","No","No","No","No","No","51-75%","51-75%","Farming","Other","Farming","Other","Farming","Other","Farming","Other","Well / water tank                          ","School materials / supplies                                         ","School materials / supplies                                         ","Cash/money assistance","Cash/money assistance","Well / water tank                          "]
["UNHCR1","19/8/2013","KBC",null,"CCCM Focal Point",null,"14/8/2013","Camp Manager","Male",null,null,"Committee Member",null,null,null,null,"Kachin","Myitkyina","Urban","Myo Thit Gyi","Jan Mai Kawng Baptist Church","MMR001CMP018",97.389778000000007,25.417733999999999,"Urban",7,2011,"Yes","Yes","Yes","No","Yes","Yes","Yes","No","Myitkyina",2,15,"yes","KBC","Saya Aung Myat","09-40001305","Yes","Yes","No","No","No","No","No","Yes","No","No","Yes","No",7,5,12,11,10,21,44,42,86,108,108,216,89,106,195,87,128,215,69,110,179,29,21,50,444,530,974,2,2,4,3,1,4,1,2,3,6,7,13,0,0,0,0,0,0,3,7,10,9,20,null,null,null,2,7,9,203,974,18,112,6,32,"yes","yes",7,5,5,2,12,7,1,"No","Yes","No","No","Yes","No",0.625,null,null,{"$f":"1/8","v":0.125},{"$f":"1/8","v":0.125},0.375,2,"Individual","Yes","Solid shelters","51-75%","0%","Yes","Borehole/hand pump","Yes",0,0,41,"Yes","Common identified waste dump inside camp","Hospital",null,"Yes","Yes","Yes","No","Yes","Yes","Yes","Yes","Yes","No","25-50%","25-50%","Mining","Other","Farming","Livestock","Handicrafts","Other","Farming","Trade (buying and selling)","Medical staff (doctor, nurse, etc)","Medical staff (doctor, nurse, etc)","Access to job opportunities        ","Access to job opportunities        ","Vocational training                       ","Cash/money assistance"]
["UNHCR2","16/8/2013","DRC",null,"Enumerator from camp profiling  responsible organization",null,"20/6/2013","Camp Manager","Male",null,null,"Committee Member","Other","Male",null,null,"Kachin","Myitkyina","Myitkyina","Le Kone","Le Kone Bethlehem Church",null,97.409317000000001,25.362189999999998,"Urban",3,2011,"Yes","Yes","Yes","No","Yes","Yes","Yes","No","Myitkyina",1,"5 minutes","Yes","KBC","U Naw Ja","09401533628","Yes","Yes","No","No","No","No","No","No","Yes","Yes","Yes","Yes",1,0,1,6,2,8,11,16,27,37,38,75,50,46,96,60,64,124,34,47,81,12,22,34,211,235,446,2,1,3,1,1,2,2,2,4,25,25,50,3,2,5,0,0,0,1,4,5,2,9,1,0,1,1,0,1,86,446,1,4,0,0,"Yes","Yes",4,4,7,3,11,7,2,"Yes","Yes","No","Yes","Yes","No",null,null,null,null,null,null,null,"Individual","Yes","Community/religious building","25-50%","51-75%","Yes","Well","Yes",null,null,null,"Yes","Identified waste dump outside camp","Hospital",null,"No","Yes","Yes","Yes","Yes","Yes","Yes","Yes","No","No","96-100%","96-100%","Mining","Other","Trade (buying and selling)","Mining","Trade (buying and selling)","Other","Trade (buying and selling)","Mining","Access to job opportunities        ","Access to job opportunities        ","Cash/money assistance","Vocational training                       ","Cash/money assistance","Vocational training                       "]
["UNHCR3","26/8/2013","UNHCR",null,"Enumerator from camp profiling  responsible organization",null,"19/8/2013","Camp Manager","Male",null,null,"Religious Leader","Camp Resident","Female",null,null,"Kachin","Bhamo",null,"Hpan Khar Kone","Phan Khar Kone","MMR001CMP193",97.252650000000003,24.222349999999999,"Rural",1,2013,"Yes","Yes","Yes","No","Yes","Yes","Yes","No","Bhamo",3,null,"Yes","KBC","U Zaw Seng",6872205,"Yes","Yes","No","No","No","No","No","No","Yes","No","Yes","Yes",3,1,4,0,3,3,4,4,8,5,5,10,4,4,8,7,16,23,8,6,14,3,5,8,{"$f":"BC127+BF127+BI127+BL127+BO127+BR127+BU127+BX127","v":34},{"$f":"BD127+BG127+BJ127+BM127+BP127+BS127+BV127+BY127","v":44},{"$f":"SUM(CA127:CB127)","v":78},0,1,1,0,0,0,0,1,1,0,0,0,0,0,0,0,0,0,0,1,1,1,5,1,2,3,0,0,0,18,78,4,14,0,0,"No","Yes",0,0,4,3,4,3,0,"No","No","No","No","Yes","No",null,null,null,null,0.25,0.25,null,"Individual","No","Solid shelters","0%","0%","Yes","Borehole/hand pump","Yes",0,0,6,"Yes","Is getting burnt","Hospital",null,"No","Yes","No","No","No","No","No","No","No","No","96-100%","96-100%","Other","None","Farming","Trade (buying and selling)","Livestock","None","Farming","Livestock","Medicines","Firewood / fuel                                                                      ","Other","Other","Firewood / fuel                                                                      ","Medicines"]
[]
[]
[]
[]
[]
[]
[]
[]
[]
[]
[]
[]
[]
[]
[]
[]
[]
[]
[]
[]
[]
[]
[]
[]
[]
[]
[]
[]
[]
[]
[]
[]
[]
[]
[]
[]
[]
[]
[]
[]
[]
[]
[]
[]
[]
[]
[]
[]
[]
[]
[]
[]
[]
[]
[]
[]
[]
[]
[]
[]
[]
[1,2,3,4,5,6,7,8,9,10,11,12,13,14,15,16,17,18,19,20,21,22,23,24,25,26,27,28,29,30,31,32,33,34,35,36,37,38,39,40,41,42,43,44,45,46,47,48,49,50,51,52,53,54,55,56,57,58,59,60,61,62,63,64,65,66,67,68,69,70,71,72,73,74,75,76,77,78,79,80,81,82,83,84,85,86,87,88,89,90,91,92,93,94,95,96,97,98,99,100,101,102,103,104,105,106,107,108,109,110,111,112,113,114,117,118,137,138,139,140,141,142,143,144,145,147,148,149,150,151,152,156,163,170,177,184,null,null,204,205,206,207,208,209,210,212,213,214,215,219,220,221,222,223,224,225,226,227,228,229,230,231,232,233,234,235,237,239,241,243,245,247,249,251,253,256,258,261,263,266,267]

{"sheet":"Lookup","index":2,"n_rows":198,"n_cols":32,"rows_kept":198,"cut":false,"hidden":false,"merged":[]}
["A1","A2","A4.a","A4.b","A4.c","E1","B9",null,"D.27","E6. ","F8. ","F10. ","F11. ","F14.","F19.","F20. ","G1. ","H",null,null,"Camp_TOWNSHIP_NAME","Local Name",null,"Date","Month","Year",null,"Region","State_Division","Township",null,"Camp Management Agency"]
["DRC","Enumerator from camp profiling  responsible organization","Camp Manager","Male","Committee Member","Yes","Urban",null,"Place of origin","Elected camp residents","Individual","Open space (without roof/wall)","0%","Well","Common identified waste dump inside camp","Hospital","Farming","Basic Food                                       ","Doctor(s)",null,"Bhamo","AD-2000 Tharthana Compound",null,1,1,2010,null,"Kachin","Kachin","Bhamo",null,"KMSS Myitkyina"]
["RANIR","CCCM Focal Point","Camp Resident","Female","FBO/NGO Staff","No","Rural",null,"Host families","Appointed camp residents","Communal","Make-shift shelters ","< 25%","Rivers, springs, etc.","Identified waste dump outside camp","Clinic","Fishing","Complementary Food                                 ","Nurse(s)",null,"Bhamo","Aung Thar Church",null,2,2,2011,null,"Shan (North)","Kachin","Chipwi",null,"KMSS Bhamo"]
["KBC","Other","Other",null,"Religious Leader",null,"Forest/bush",null,"Other IDP camps","Any camp resident","Mixed","Community/religious building","25-50%","Borehole/hand pump","Dumped everywhere inside the camp","Rural centre","Livestock","Firewood / fuel                                                                      ","Mid-wives",null,"Bhamo","Daw Hpum Yang Ninghtawn",null,3,3,2012,null,null,"Kachin","Hpakan",null,"Shalom"]
["UNHCR",null,null,null,"Teacher",null,null,null,"Abroad","Elders ",null,"Solid shelters","51-75%","Other","Is getting burnt","Rural sub-centre","Manufacturing (food processing)","Individual shelter/houses             ","Community worker(s)",null,"Bhamo","Host Families",null,4,4,2013,null,null,"Kachin","Injangyang"]
["KBSS/KMSS",null,null,null,"Doctor / Nurse / Midwife",null,null,null,"Other?","Religious leaders",null,null,"76-95%",null,null,"Referral centre","Mining","Communal building                      ","Vaccination",null,"Bhamo","Htoi San Church",null,5,5,null,null,null,"Kachin","Khaunglanhpu"]
["SHALOM",null,null,null,"Authority",null,null,null,"Don't know","Others",null,null,"96-100%",null,null,"Other","Trade (buying and selling)","Partitions within shelters","Preventive health care",null,"Bhamo","Kannar Yeik Thar",null,6,6,null,null,null,"Kachin","Machanbaw"]
["OTHER",null,null,null,"Other",null,null,null,null,"Don't know",null,null,null,null,null,null,"Manufacturing (non-food)","Blankets/Winter Clothing                                         ","Pre&Post natal care",null,"Bhamo","Lisu Boarding-House",null,7,7,null,null,null,"Kachin","Mansi"]
[null,null,null,null,null,null,null,null,null,null,null,null,null,null,null,null,"Handicrafts","Hygiene kits                                         ","Reproductive health care ",null,"Bhamo","Mu-yin Baptist Church",null,8,8,null,null,null,"Kachin","Mogaung"]
[null,null,null,null,null,null,null,null,null,null,null,null,null,null,null,null,"Other","Kitchen sets                                         ","Psychosocial support services ",null,"Bhamo","Nant Hlaing Church",null,9,9,null,null,null,"Kachin","Mohnyin"]
[null,null,null,null,null,null,null,null,null,null,null,null,null,null,null,null,"None","Women NFIs (sanitary pads, underwear, etc.)","Don’t know",null,"Bhamo","Phan Khar Kone",null,10,10,null,null,null,"Kachin","Momauk"]
[null,null,null,null,null,null,null,null,null,null,null,null,null,null,null,null,null,"Health facility / Clinic                                         ",null,null,"Bhamo","Robert Church",null,11,11,null,null,null,"Kachin","Myitkyina"]
[null,null,null,null,null,null,null,null,null,null,null,null,null,null,null,null,null,"Medicines",null,null,"Bhamo","Ta Gun Taing Monastery (Shwe Kyi Na)",null,12,12,null,null,null,"Kachin","Nawngmun"]
[null,null,null,null,null,null,null,null,null,null,null,null,null,null,null,null,null,"Medical staff (doctor, nurse, etc)",null,null,"Bhamo","Yoe Kyi Monastery",null,13,null,null,null,null,"Kachin","Puta-O"]
[null,null,null,null,null,null,null,null,null,null,null,null,null,null,null,null,null,"School facilities",null,null,"Chipwi","Chipwi KBC camp",null,14,null,null,null,null,"Kachin","Shwegu"]
[null,null,null,null,null,null,null,null,null,null,null,null,null,null,null,null,null,"School materials / supplies                                         ",null,null,"Chipwi","Gant Gwin",null,15,null,null,null,null,"Kachin","Sumprabum"]
[null,null,null,null,null,null,null,null,null,null,null,null,null,null,null,null,null,"Transport to school                     ",null,null,"Chipwi","Hpare Hkyer - BP6",null,16,null,null,null,null,"Kachin","Tanai"]
[null,null,null,null,null,null,null,null,null,null,null,null,null,null,null,null,null,"Well / water tank                          ",null,null,"Chipwi","Lan Jaw ",null,17,null,null,null,null,"Kachin","Tsawlaw"]
[null,null,null,null,null,null,null,null,null,null,null,null,null,null,null,null,null,"Bathing spaces                                      ",null,null,"Chipwi","Lhaovao Baptist Church (LBC)",null,18,null,null,null,null,"Kachin","Waingmaw"]
[null,null,null,null,null,null,null,null,null,null,null,null,null,null,null,null,null,"Latrines/toilets                                      ",null,null,"Chipwi","Women's Affairs Association Building",null,19,null,null,null,null,"Shan (North)","Lashio"]
[null,null,null,null,null,null,null,null,null,null,null,null,null,null,null,null,null,"Access to job opportunities        ",null,null,"Hpakan","1 Ward, Sein Yadanar Company(Lon Khin)",null,20,null,null,null,null,"Shan (North)","Hseni"]
[null,null,null,null,null,null,null,null,null,null,null,null,null,null,null,null,null,"Cash/money assistance",null,null,"Hpakan","5 Ward Baptist Church(lon Khin)",null,21,null,null,null,null,"Shan (North)","Mongyai"]
[null,null,null,null,null,null,null,null,null,null,null,null,null,null,null,null,null,"Vocational training                       ",null,null,"Hpakan","5 Ward RC Church(lon Khin)",null,22,null,null,null,null,"Shan (North)","Tangyan"]
[null,null,null,null,null,null,null,null,null,null,null,null,null,null,null,null,null,"Other",null,null,"Hpakan","AG Church, Hmaw Si Sa",null,23,null,null,null,null,"Shan (North)","Pangsang"]
[null,null,null,null,null,null,null,null,null,null,null,null,null,null,null,null,null,null,null,null,"Hpakan","AG Church, Maw Wan",null,24,null,null,null,null,"Shan (North)","Namphan"]
[null,null,null,null,null,null,null,null,null,null,null,null,null,null,null,null,null,null,null,null,"Hpakan","Anglican Church, Hmaw Si Sar",null,25,null,null,null,null,"Shan (North)","Pangwaun"]
[null,null,null,null,null,null,null,null,null,null,null,null,null,null,null,null,null,null,null,null,"Hpakan","Association of Christ, Nam Ma Phyit",null,26,null,null,null,null,"Shan (North)","Mongmao"]
[null,null,null,null,null,null,null,null,null,null,null,null,null,null,null,null,null,null,null,null,"Hpakan","Away Yar Rama Monastery, Ka Day village",null,27,null,null,null,null,"Shan (North)","Muse"]
[null,null,null,null,null,null,null,null,null,null,null,null,null,null,null,null,null,null,null,null,"Hpakan","Aye Mya Tharyar Church of Christ ",null,28,null,null,null,null,"Shan (North)","Namhkan"]
[null,null,null,null,null,null,null,null,null,null,null,null,null,null,null,null,null,null,null,null,"Hpakan","Baptist Church, Hmaw Si Sar(Lon Khin)",null,29,null,null,null,null,"Shan (North)","Kutkai"]
[null,null,null,null,null,null,null,null,null,null,null,null,null,null,null,null,null,null,null,null,"Hpakan","Baptist Church, Naung Hmee VT",null,30,null,null,null,null,"Shan (North)","Kyaukme"]
[null,null,null,null,null,null,null,null,null,null,null,null,null,null,null,null,null,null,null,null,"Hpakan","Baptist Church, Sai Ra village",null,31,null,null,null,null,"Shan (North)","Nawnghkio"]
[null,null,null,null,null,null,null,null,null,null,null,null,null,null,null,null,null,null,null,null,"Hpakan","Chin Church, Seik Mu",null,null,null,null,null,null,"Shan (North)","Hsipaw"]
[null,null,null,null,null,null,null,null,null,null,null,null,null,null,null,null,null,null,null,null,"Hpakan","Chin(Zomi) Baptist Church",null,null,null,null,null,null,"Shan (North)","Namtu"]
[null,null,null,null,null,null,null,null,null,null,null,null,null,null,null,null,null,null,null,null,"Hpakan","Dhama Rakhita, Nyein Chan Tar Yar Ward(Lon Khin)",null,null,null,null,null,null,"Shan (North)","Namhsan"]
[null,null,null,null,null,null,null,null,null,null,null,null,null,null,null,null,null,null,null,null,"Hpakan","Ei Wan Gali Asso., Ward 1, Seik Mu",null,null,null,null,null,null,"Shan (North)","Mongmit"]
[null,null,null,null,null,null,null,null,null,null,null,null,null,null,null,null,null,null,null,null,"Hpakan","Free Christian Asso., Ward 1, Seik Mu",null,null,null,null,null,null,"Shan (North)","Mabein"]
[null,null,null,null,null,null,null,null,null,null,null,null,null,null,null,null,null,null,null,null,"Hpakan","Hlaing Naung Baptist",null,null,null,null,null,null,"Shan (North)","Manton"]
[null,null,null,null,null,null,null,null,null,null,null,null,null,null,null,null,null,null,null,null,"Hpakan","Hmaw Wan, Anglican",null,null,null,null,null,null,"Shan (North)","Kunlong"]
[null,null,null,null,null,null,null,null,null,null,null,null,null,null,null,null,null,null,null,null,"Hpakan","Hmaw Wan, Baptist Christian Church",null,null,null,null,null,null,"Shan (North)","Hopang"]
[null,null,null,null,null,null,null,null,null,null,null,null,null,null,null,null,null,null,null,null,"Hpakan","Lisu Baptist Church, Maw Shan Vil,. Seik Mu",null,null,null,null,null,null,"Shan (North)","Laukkaing"]
[null,null,null,null,null,null,null,null,null,null,null,null,null,null,null,null,null,null,null,null,"Hpakan","Lisu Baptist Church, Maw Wan Ward",null,null,null,null,null,null,"Shan (North)","Konkyan"]
[null,null,null,null,null,null,null,null,null,null,null,null,null,null,null,null,null,null,null,null,"Hpakan","Ma Mon Buddhist Monastery",null,null,null,null,null,null,"Shan (North)","Nam Tit"]
[null,null,null,null,null,null,null,null,null,null,null,null,null,null,null,null,null,null,null,null,"Hpakan","Mashi Kahtawng Baptist  Church",null,null,null,null,null,null,"Shan (North)","Nar Wee (Na Wi)"]
[null,null,null,null,null,null,null,null,null,null,null,null,null,null,null,null,null,null,null,null,"Hpakan","Mashi Kahtawng Catholic Church",null,null,null,null,null,null,"Shan (North)","Man Tun"]
[null,null,null,null,null,null,null,null,null,null,null,null,null,null,null,null,null,null,null,null,"Hpakan","Mashi Kahtawng Evangelical Church",null,null,null,null,null,null,"Shan (North)","Kawng Min Hsang"]
[null,null,null,null,null,null,null,null,null,null,null,null,null,null,null,null,null,null,null,null,"Hpakan","Mashi Kahtawng Municipal Dammar Yone",null,null,null,null,null,null,"Shan (North)","Hsawng Hpa (Saun Pha)"]
[null,null,null,null,null,null,null,null,null,null,null,null,null,null,null,null,null,null,null,null,"Hpakan","Mashi Kahtawng Myo Oo Taw Ya Monestry",null,null,null,null,null,null,"Shan (North)","Hkun Mar (Hkwin Ma)"]
[null,null,null,null,null,null,null,null,null,null,null,null,null,null,null,null,null,null,null,null,"Hpakan","Mashi Kahtawng Rakhine traditional group",null,null,null,null,null,null,"Shan (North)","Long Htan"]
[null,null,null,null,null,null,null,null,null,null,null,null,null,null,null,null,null,null,null,null,"Hpakan","Mashi Kahtawng Shan Traditional Monestry",null,null,null,null,null,null,"Shan (North)","Yawng Lin"]
[null,null,null,null,null,null,null,null,null,null,null,null,null,null,null,null,null,null,null,null,"Hpakan","Mashi Kahtawng Yaung Chi Oo Thi la shin Monestry",null,null,null,null,null,null,"Shan (North)","Lin Haw"]
[null,null,null,null,null,null,null,null,null,null,null,null,null,null,null,null,null,null,null,null,"Hpakan","Maw Si Zar, Thiriyardanar Sein, Damma Compound, Lone Khin",null,null,null,null,null,null,"Shan (North)","Ka Lawng Hpar"]
[null,null,null,null,null,null,null,null,null,null,null,null,null,null,null,null,null,null,null,null,"Hpakan","Maw Wan, Catholic Church",null,null,null,null,null,null,"Shan (North)","Aik Chan (Ai' Chun)"]
[null,null,null,null,null,null,null,null,null,null,null,null,null,null,null,null,null,null,null,null,"Hpakan","Maw Wan, Kachin Baptist Church",null,null,null,null,null,null,"Shan (North)","Yin Pang"]
[null,null,null,null,null,null,null,null,null,null,null,null,null,null,null,null,null,null,null,null,"Hpakan","Maw Wan, Kyauk Hlaing Gu Pagoda Compound",null,null,null,null,null,null,"Shan (North)","Man Man Hseng"]
[null,null,null,null,null,null,null,null,null,null,null,null,null,null,null,null,null,null,null,null,"Hpakan","Maw Wan, Mu-yin Baptist Church",null,null,null,null,null,null,"Shan (North)","Nawng Hkit"]
[null,null,null,null,null,null,null,null,null,null,null,null,null,null,null,null,null,null,null,null,"Hpakan","Maw Wan, Myo Oo Pagoda",null,null,null,null,null,null,"Shan (North)","Nam Hkam Wu"]
[null,null,null,null,null,null,null,null,null,null,null,null,null,null,null,null,null,null,null,null,"Hpakan","May Di Ka Rama Monastery(Lon Khin)",null,null,null,null,null,null,"Shan (North)","Nar Kawng"]
[null,null,null,null,null,null,null,null,null,null,null,null,null,null,null,null,null,null,null,null,"Hpakan","Muring Baptist Church, Awng Ra, Wa Ra Zut VT",null,null,null,null,null,null,"Shan (North)","Pang Hkam"]
[null,null,null,null,null,null,null,null,null,null,null,null,null,null,null,null,null,null,null,null,"Hpakan","Nant Ma Hpit Catholic Church",null,null,null,null,null,null,"Shan (North)","Pang Yang"]
[null,null,null,null,null,null,null,null,null,null,null,null,null,null,null,null,null,null,null,null,"Hpakan","Nga Pyaw Taw Baptist Nursery School ",null,null,null,null,null,null,"Shan (North)","Mong Hpen"]
[null,null,null,null,null,null,null,null,null,null,null,null,null,null,null,null,null,null,null,null,"Hpakan","Nga Pyaw Taw Roman Catholic Church",null,null,null,null,null,null,"Shan (North)","Ho Tawng ( Ho Tao)"]
[null,null,null,null,null,null,null,null,null,null,null,null,null,null,null,null,null,null,null,null,"Hpakan","Parami, Charity Office, MyoMa Quarter",null,null,null,null,null,null,"Shan (North)","Mong Pawk"]
[null,null,null,null,null,null,null,null,null,null,null,null,null,null,null,null,null,null,null,null,"Hpakan","Rawan Baptist Church, Maw Shan Vil., Seik Mu",null,null,null,null,null,null,"Shan (North)","Mong Kar"]
[null,null,null,null,null,null,null,null,null,null,null,null,null,null,null,null,null,null,null,null,"Hpakan","Sa Baw Sarsana Parla Monastery",null,null,null,null,null,null,"Shan (North)","Nam Hpai"]
[null,null,null,null,null,null,null,null,null,null,null,null,null,null,null,null,null,null,null,null,"Hpakan","Sai Nai Baptish Church, Maw Shan Vil., Seki Mu"]
[null,null,null,null,null,null,null,null,null,null,null,null,null,null,null,null,null,null,null,null,"Hpakan","San Kyel, Masoe Yein Monestry"]
[null,null,null,null,null,null,null,null,null,null,null,null,null,null,null,null,null,null,null,null,"Hpakan","Tar Ma Hkan Buddhist Monastery, Haung Par"]
[null,null,null,null,null,null,null,null,null,null,null,null,null,null,null,null,null,null,null,null,"Hpakan","Thiri Mingalar Manizay Yone, Myoma Quarter"]
[null,null,null,null,null,null,null,null,null,null,null,null,null,null,null,null,null,null,null,null,"Hpakan","Ward 2 Cahotlic Church, Seik Mu"]
[null,null,null,null,null,null,null,null,null,null,null,null,null,null,null,null,null,null,null,null,"Hpakan","Ward 2 Sai Taung Baptist Church, Seik Mu "]
[null,null,null,null,null,null,null,null,null,null,null,null,null,null,null,null,null,null,null,null,"Hpakan","Wrad(5) Christian Association"]
[null,null,null,null,null,null,null,null,null,null,null,null,null,null,null,null,null,null,null,null,"Hpakan","Yumar Baptist Church"]
[null,null,null,null,null,null,null,null,null,null,null,null,null,null,null,null,null,null,null,null,"Injangyang","Lawk Hkawng Ginwang"]
[null,null,null,null,null,null,null,null,null,null,null,null,null,null,null,null,null,null,null,null,"Khaunglanhpu","La Ja"]
[null,null,null,null,null,null,null,null,null,null,null,null,null,null,null,null,null,null,null,null,"Kutkai","Kone Khem Camp"]
[null,null,null,null,null,null,null,null,null,null,null,null,null,null,null,null,null,null,null,null,"Kutkai","Kutkai downtown (KBC Church)"]
[null,null,null,null,null,null,null,null,null,null,null,null,null,null,null,null,null,null,null,null,"Kutkai","Kutkai downtown (RC Church)"]
[null,null,null,null,null,null,null,null,null,null,null,null,null,null,null,null,null,null,null,null,"Kutkai","Mine Yu Lay village"]
[null,null,null,null,null,null,null,null,null,null,null,null,null,null,null,null,null,null,null,null,"Kutkai","Mungji Pa Dabang (Baptist Church)         "]
[null,null,null,null,null,null,null,null,null,null,null,null,null,null,null,null,null,null,null,null,"Kutkai","Mungji Pa Dabang (RC Church)         "]
[null,null,null,null,null,null,null,null,null,null,null,null,null,null,null,null,null,null,null,null,"Kutkai","Nam Hpak Ka Mare "]
[null,null,null,null,null,null,null,null,null,null,null,null,null,null,null,null,null,null,null,null,"Kutkai","Zup Aung Camp"]
[null,null,null,null,null,null,null,null,null,null,null,null,null,null,null,null,null,null,null,null,"Mansi","Host Families"]
[null,null,null,null,null,null,null,null,null,null,null,null,null,null,null,null,null,null,null,null,"Mansi","Lung Kawk  ( Hka Hkye Zup)"]
[null,null,null,null,null,null,null,null,null,null,null,null,null,null,null,null,null,null,null,null,"Mansi","Man Wing Baptist Church"]
[null,null,null,null,null,null,null,null,null,null,null,null,null,null,null,null,null,null,null,null,"Mansi","Man Wing Catholic Church"]
[null,null,null,null,null,null,null,null,null,null,null,null,null,null,null,null,null,null,null,null,"Mansi","Man Wing Host Families"]
[null,null,null,null,null,null,null,null,null,null,null,null,null,null,null,null,null,null,null,null,"Mansi","Mansi Baptist Church"]
[null,null,null,null,null,null,null,null,null,null,null,null,null,null,null,null,null,null,null,null,"Mansi","Nam Hka Mare (west of Man Wing)"]
[null,null,null,null,null,null,null,null,null,null,null,null,null,null,null,null,null,null,null,null,"Mansi","Nam Lim Pa - Scattered IDPs in forest"]
[null,null,null,null,null,null,null,null,null,null,null,null,null,null,null,null,null,null,null,null,"Mansi","Lagatyan "]
[null,null,null,null,null,null,null,null,null,null,null,null,null,null,null,null,null,null,null,null,"Manton","Mandung - Jinghpaw"]
[null,null,null,null,null,null,null,null,null,null,null,null,null,null,null,null,null,null,null,null,"Manton","Howa"]
[null,null,null,null,null,null,null,null,null,null,null,null,null,null,null,null,null,null,null,null,"Manton","Nam Hkyet"]
[null,null,null,null,null,null,null,null,null,null,null,null,null,null,null,null,null,null,null,null,"Mogaung","Kyun Taw Baptist Church "]
[null,null,null,null,null,null,null,null,null,null,null,null,null,null,null,null,null,null,null,null,"Mogaung","Mang Hawng Baptist Church"]
[null,null,null,null,null,null,null,null,null,null,null,null,null,null,null,null,null,null,null,null,"Mogaung","Nat Gyi Kone Baptist Church "]
[null,null,null,null,null,null,null,null,null,null,null,null,null,null,null,null,null,null,null,null,"Mohnyin","Nant Mun"]
[null,null,null,null,null,null,null,null,null,null,null,null,null,null,null,null,null,null,null,null,"Mohnyin","Nawng Ing (Indawgyi) Baptist Church  "]
[null,null,null,null,null,null,null,null,null,null,null,null,null,null,null,null,null,null,null,null,"Mohnyin","St. Patrick Catholic Church "]
[null,null,null,null,null,null,null,null,null,null,null,null,null,null,null,null,null,null,null,null,"Momauk","Bum Tsit Pa "]
[null,null,null,null,null,null,null,null,null,null,null,null,null,null,null,null,null,null,null,null,"Momauk","Dum Bung "]
[null,null,null,null,null,null,null,null,null,null,null,null,null,null,null,null,null,null,null,null,"Momauk","Hpun Lum Yang "]
[null,null,null,null,null,null,null,null,null,null,null,null,null,null,null,null,null,null,null,null,"Momauk","Je Yang Hka "]
[null,null,null,null,null,null,null,null,null,null,null,null,null,null,null,null,null,null,null,null,"Momauk","Lana Zup Ja "]
[null,null,null,null,null,null,null,null,null,null,null,null,null,null,null,null,null,null,null,null,"Momauk","Nhkawng Pa "]
[null,null,null,null,null,null,null,null,null,null,null,null,null,null,null,null,null,null,null,null,"Momauk","Pa Kahtawng "]
[null,null,null,null,null,null,null,null,null,null,null,null,null,null,null,null,null,null,null,null,"Momauk","Host Families"]
[null,null,null,null,null,null,null,null,null,null,null,null,null,null,null,null,null,null,null,null,"Momauk","Loi Je Baptist Church"]
[null,null,null,null,null,null,null,null,null,null,null,null,null,null,null,null,null,null,null,null,"Momauk","Loi Je Catholic Church"]
[null,null,null,null,null,null,null,null,null,null,null,null,null,null,null,null,null,null,null,null,"Momauk","Loi Je Lisu Camp"]
[null,null,null,null,null,null,null,null,null,null,null,null,null,null,null,null,null,null,null,null,"Momauk","Mai Khat "]
[null,null,null,null,null,null,null,null,null,null,null,null,null,null,null,null,null,null,null,null,"Momauk","Man Bung Catholic compound"]
[null,null,null,null,null,null,null,null,null,null,null,null,null,null,null,null,null,null,null,null,"Momauk","Man Nawng "]
[null,null,null,null,null,null,null,null,null,null,null,null,null,null,null,null,null,null,null,null,"Momauk","Man Ting"]
[null,null,null,null,null,null,null,null,null,null,null,null,null,null,null,null,null,null,null,null,"Momauk","Mandalay Monestry"]
[null,null,null,null,null,null,null,null,null,null,null,null,null,null,null,null,null,null,null,null,"Momauk","Momauk Baptist Church"]
[null,null,null,null,null,null,null,null,null,null,null,null,null,null,null,null,null,null,null,null,"Momauk","Momauk Catholic Church (St. Patrick)"]
[null,null,null,null,null,null,null,null,null,null,null,null,null,null,null,null,null,null,null,null,"Momauk","Myo Thit "]
[null,null,null,null,null,null,null,null,null,null,null,null,null,null,null,null,null,null,null,null,"Momauk","Ni Thaw Ka Monestry"]
[null,null,null,null,null,null,null,null,null,null,null,null,null,null,null,null,null,null,null,null,"Momauk","Nyaung Na Pin "]
[null,null,null,null,null,null,null,null,null,null,null,null,null,null,null,null,null,null,null,null,"Momauk","Phar Kay/Nant Waing "]
[null,null,null,null,null,null,null,null,null,null,null,null,null,null,null,null,null,null,null,null,"Momauk","Seng Ja "]
[null,null,null,null,null,null,null,null,null,null,null,null,null,null,null,null,null,null,null,null,"Momauk","Tarli "]
[null,null,null,null,null,null,null,null,null,null,null,null,null,null,null,null,null,null,null,null,"Muse","Hka San Camp"]
[null,null,null,null,null,null,null,null,null,null,null,null,null,null,null,null,null,null,null,null,"Muse","Munekoe Pa (Giwang) - Hka San (Mung  Go  Pa ) "]
[null,null,null,null,null,null,null,null,null,null,null,null,null,null,null,null,null,null,null,null,"Muse","Hpai Kawng Mare"]
[null,null,null,null,null,null,null,null,null,null,null,null,null,null,null,null,null,null,null,null,"Muse","Mung Baw "]
[null,null,null,null,null,null,null,null,null,null,null,null,null,null,null,null,null,null,null,null,"Myitkyina","Du Kahtawng Qtr. 14"]
[null,null,null,null,null,null,null,null,null,null,null,null,null,null,null,null,null,null,null,null,"Myitkyina","Du Kahtawng Qtr. 4"]
[null,null,null,null,null,null,null,null,null,null,null,null,null,null,null,null,null,null,null,null,"Myitkyina","Du Kahtawng Qtr. 5"]
[null,null,null,null,null,null,null,null,null,null,null,null,null,null,null,null,null,null,null,null,"Myitkyina","Jan Mai Kawng Baptist Church"]
[null,null,null,null,null,null,null,null,null,null,null,null,null,null,null,null,null,null,null,null,"Myitkyina","Jan Mai Kawng Catholic Church"]
[null,null,null,null,null,null,null,null,null,null,null,null,null,null,null,null,null,null,null,null,"Myitkyina","Kyun Pin Thar Baptist Church"]
[null,null,null,null,null,null,null,null,null,null,null,null,null,null,null,null,null,null,null,null,"Myitkyina","Le Kone Bethlehem Church"]
[null,null,null,null,null,null,null,null,null,null,null,null,null,null,null,null,null,null,null,null,"Myitkyina","Le Kone Ziun Baptist Church "]
[null,null,null,null,null,null,null,null,null,null,null,null,null,null,null,null,null,null,null,null,"Myitkyina","Maliyang Baptist Church"]
[null,null,null,null,null,null,null,null,null,null,null,null,null,null,null,null,null,null,null,null,"Myitkyina","Man Hkring Baptist Church"]
[null,null,null,null,null,null,null,null,null,null,null,null,null,null,null,null,null,null,null,null,"Myitkyina","Maw Hpawng Hka Nan Baptist Church"]
[null,null,null,null,null,null,null,null,null,null,null,null,null,null,null,null,null,null,null,null,"Myitkyina","Maw Hpawng Lhaovo Baptist Church"]
[null,null,null,null,null,null,null,null,null,null,null,null,null,null,null,null,null,null,null,null,"Myitkyina","Myay Myint Baptist Church"]
[null,null,null,null,null,null,null,null,null,null,null,null,null,null,null,null,null,null,null,null,"Myitkyina","Nan Kway St. John Catholic Church"]
[null,null,null,null,null,null,null,null,null,null,null,null,null,null,null,null,null,null,null,null,"Myitkyina","Njang Dung Baptist Church "]
[null,null,null,null,null,null,null,null,null,null,null,null,null,null,null,null,null,null,null,null,"Myitkyina","Nong Pong Camp"]
[null,null,null,null,null,null,null,null,null,null,null,null,null,null,null,null,null,null,null,null,"Myitkyina","Pa Dauk Myaing(Pa La Na)"]
[null,null,null,null,null,null,null,null,null,null,null,null,null,null,null,null,null,null,null,null,"Myitkyina","Shatapru Sut Ngai Tawng"]
[null,null,null,null,null,null,null,null,null,null,null,null,null,null,null,null,null,null,null,null,"Myitkyina","Shatapru Thida Aye Baptist Church"]
[null,null,null,null,null,null,null,null,null,null,null,null,null,null,null,null,null,null,null,null,"Myitkyina","Shwe Zet Baptist Church"]
[null,null,null,null,null,null,null,null,null,null,null,null,null,null,null,null,null,null,null,null,"Myitkyina","Tat Kone Baptist Church"]
[null,null,null,null,null,null,null,null,null,null,null,null,null,null,null,null,null,null,null,null,"Myitkyina","Tat Kone COC Baptist / Tat Kone Htoi San"]
[null,null,null,null,null,null,null,null,null,null,null,null,null,null,null,null,null,null,null,null,"Myitkyina","Tat Kone Emanuel Church"]
[null,null,null,null,null,null,null,null,null,null,null,null,null,null,null,null,null,null,null,null,"Myitkyina","Tat Kone Galile Baptist Church"]
[null,null,null,null,null,null,null,null,null,null,null,null,null,null,null,null,null,null,null,null,"Myitkyina","Tat Kone San Pya Baptist Church"]
[null,null,null,null,null,null,null,null,null,null,null,null,null,null,null,null,null,null,null,null,"Myitkyina","Wun Tho Buddhist Monastery"]
[null,null,null,null,null,null,null,null,null,null,null,null,null,null,null,null,null,null,null,null,"Namhkan","Mung Ding Pa "]
[null,null,null,null,null,null,null,null,null,null,null,null,null,null,null,null,null,null,null,null,"Namhkan","Nam Hkam Malut Jak "]
[null,null,null,null,null,null,null,null,null,null,null,null,null,null,null,null,null,null,null,null,"Namhkan","Nam Hkam - Nay Win Ni (Palawng)"]
[null,null,null,null,null,null,null,null,null,null,null,null,null,null,null,null,null,null,null,null,"Namhkan","Nam Hkam (KBC Jaw Wang)"]
[null,null,null,null,null,null,null,null,null,null,null,null,null,null,null,null,null,null,null,null,"Namhkan","Nam Hkam Catholic Church ( St. Thomas I)"]
[null,null,null,null,null,null,null,null,null,null,null,null,null,null,null,null,null,null,null,null,"Namhkan","Nam Hkam Catholic Church ( St. Thomas II)"]
[null,null,null,null,null,null,null,null,null,null,null,null,null,null,null,null,null,null,null,null,"Namhkan","Nam Hkawng"]
[null,null,null,null,null,null,null,null,null,null,null,null,null,null,null,null,null,null,null,null,"Namtu","Nam Tu"]
[null,null,null,null,null,null,null,null,null,null,null,null,null,null,null,null,null,null,null,null,"Puta-O","Tote Tan Ward"]
[null,null,null,null,null,null,null,null,null,null,null,null,null,null,null,null,null,null,null,null,"Shwegu","Lawk Awng Mare D. (Sinbo Area)"]
[null,null,null,null,null,null,null,null,null,null,null,null,null,null,null,null,null,null,null,null,"Shwegu","Host Families"]
[null,null,null,null,null,null,null,null,null,null,null,null,null,null,null,null,null,null,null,null,"Shwegu","Shwe Gu Baptist Church"]
[null,null,null,null,null,null,null,null,null,null,null,null,null,null,null,null,null,null,null,null,"Shwegu","Shwe Gu Catholic Church"]
[null,null,null,null,null,null,null,null,null,null,null,null,null,null,null,null,null,null,null,null,"Waingmaw","Moke Lwe Village / Hkar Shi"]
[null,null,null,null,null,null,null,null,null,null,null,null,null,null,null,null,null,null,null,null,"Waingmaw","Nawng Si Paw Village / Inn Lay"]
[null,null,null,null,null,null,null,null,null,null,null,null,null,null,null,null,null,null,null,null,"Waingmaw","Border Post 10"]
[null,null,null,null,null,null,null,null,null,null,null,null,null,null,null,null,null,null,null,null,"Waingmaw","Border Post 8"]
[null,null,null,null,null,null,null,null,null,null,null,null,null,null,null,null,null,null,null,null,"Waingmaw","Hkat Cho "]
[null,null,null,null,null,null,null,null,null,null,null,null,null,null,null,null,null,null,null,null,"Waingmaw","Hkau Shau (BP 12)"]
[null,null,null,null,null,null,null,null,null,null,null,null,null,null,null,null,null,null,null,null,"Waingmaw","Laiza Market 3 / Laiza Gat"]
[null,null,null,null,null,null,null,null,null,null,null,null,null,null,null,null,null,null,null,null,"Waingmaw","Laiza Muklum Hpyen  Yen Mungshawa ni"]
[null,null,null,null,null,null,null,null,null,null,null,null,null,null,null,null,null,null,null,null,"Waingmaw","Mading Baptist Church"]
[null,null,null,null,null,null,null,null,null,null,null,null,null,null,null,null,null,null,null,null,"Waingmaw","Maga Yang "]
[null,null,null,null,null,null,null,null,null,null,null,null,null,null,null,null,null,null,null,null,"Waingmaw","Maina AG Church"]
[null,null,null,null,null,null,null,null,null,null,null,null,null,null,null,null,null,null,null,null,"Waingmaw","Maina Catholic Church (St. Joseph)"]
[null,null,null,null,null,null,null,null,null,null,null,null,null,null,null,null,null,null,null,null,"Waingmaw","Maina KBC (Bawng Ring)"]
[null,null,null,null,null,null,null,null,null,null,null,null,null,null,null,null,null,null,null,null,"Waingmaw","Maina Lawang Baptist Church"]
[null,null,null,null,null,null,null,null,null,null,null,null,null,null,null,null,null,null,null,null,"Waingmaw","Manau Compound"]
[null,null,null,null,null,null,null,null,null,null,null,null,null,null,null,null,null,null,null,null,"Waingmaw","Nawng Hee Village"]
[null,null,null,null,null,null,null,null,null,null,null,null,null,null,null,null,null,null,null,null,"Waingmaw","Pajau / Jan Mai"]
[null,null,null,null,null,null,null,null,null,null,null,null,null,null,null,null,null,null,null,null,"Waingmaw","Post 6 Camp"]
[null,null,null,null,null,null,null,null,null,null,null,null,null,null,null,null,null,null,null,null,"Waingmaw","Qtr. 2 Lhaovo Baptist Church"]
[null,null,null,null,null,null,null,null,null,null,null,null,null,null,null,null,null,null,null,null,"Waingmaw","Qtr. 2 Myoma Baptist Church"]
[null,null,null,null,null,null,null,null,null,null,null,null,null,null,null,null,null,null,null,null,"Waingmaw","Qtr. 3 Mu-yin  Baptist Church"]
[null,null,null,null,null,null,null,null,null,null,null,null,null,null,null,null,null,null,null,null,"Waingmaw","Qtr. 4 Monestry (Thargaya Thayett Taw)"]
[null,null,null,null,null,null,null,null,null,null,null,null,null,null,null,null,null,null,null,null,"Waingmaw","Shing Jai"]
[null,null,null,null,null,null,null,null,null,null,null,null,null,null,null,null,null,null,null,null,"Waingmaw","Thargaya Lisu Baptist Church"]
[null,null,null,null,null,null,null,null,null,null,null,null,null,null,null,null,null,null,null,null,"Waingmaw","Waingmaw AG Church"]
[null,null,null,null,null,null,null,null,null,null,null,null,null,null,null,null,null,null,null,null,"Waingmaw","Waingmaw Baptist Zonal Office"]
[null,null,null,null,null,null,null,null,null,null,null,null,null,null,null,null,null,null,null,null,"Waingmaw","Woi Chyai "]
[null,null,null,null,null,null,null,null,null,null,null,null,null,null,null,null,null,null,null,null,"Waingmaw","Zai Awng / Mung Ga Zup"]
[null,null,null,null,null,null,null,null,null,null,null,null,null,null,null,null,null,null,null,null,"Momauk","Khun Sint Village"]
[null,null,null,null,null,null,null,null,null,null,null,null,null,null,null,null,null,null,null,null,"Hpakan","Zomee Baptist Church camp, Hmaw Wan"]

{"sheet":"Infographics","index":3,"n_rows":89,"n_cols":34,"rows_kept":89,"cut":false,"hidden":false,"merged":[[7,23,12,24],[46,24,48,25],[46,26,48,27],[46,23,48,23],[41,9,41,10],[41,11,41,12]]}
[null,null,null,null,null,null,null,null,null,null,null,null,null,null,null,null,null,null,null,null,null,null,null,null,6]
[]
[null,null,null,null,null,null,null,null,null,null,null,null,null,null,null,null,null,null,null,null,null,null,null,"Select the Camp ","Shatapru Sut Ngai Tawng"]
[null,null,null,null,null,null,null,null,null,null,null,null,null,null,null,null,null,null,null,null,null,null,null,"Select the Camp "]
[null,null,null,null,null,null,null,null,null,null,null,null,null,null,null,null,null,null,null,null,null,null,null,"Camp Number",{"$f":"ROW(Y3)","v":3}]
[]
[]
[null,null,null,null,null,null,null,null,null,null,null,null,null,null,null,null,null,null,null,null,null,null,null,"Reasons for difference in data between CCCM camp List & Camp Profiling: one period (6th June - 21st July), did not cover all camps & one source"]
[]
[]
[]
[]
[]
[]
[]
[]
[null,null,null,null,null,null,null,null,null,null,null,null,null,null,null,null,null,null,null,null,null,null,null,"POPULATION LIVING IN THE CAMP, BY AGE GROUPS:"]
[null,null,null,null,null,null,null,null,null,null,null,null,null,null,null,null,null,null,null,null,null,null,null,"Age (Years)","Male","Female","Total"]
[null,null,null,null,null,null,null,null,null,null,null,null,null,null,null,null,null,null,null,null,null,null,null,"0 - 5 Months",{"$f":"   IF(INDEX(D5_01,Y5) *-1=0,\"\",INDEX(D5_01,Y5) *-1)","v":-1},{"$f":"INDEX(D5_02,RN)","v":3},{"$f":"INDEX(D5_03,RN)","v":6}]
[null,null,null,null,null,null,null,null,null,null,null,null,null,null,null,null,null,null,null,null,null,null,null,"6 - 23 Months",{"$f":" IF(INDEX(D6_01,Y5)*-1=0,\"\",INDEX(D6_01,Y5)*-1)","v":-2},{"$f":"INDEX(D6_02,Y5)","v":3},{"$f":"INDEX(D6_03,RN)","v":21}]
[null,null,null,null,null,null,null,null,null,null,null,null,null,null,null,null,null,null,null,null,null,null,null,"2 - 4",{"$f":" IF(INDEX(D7_01,Y5)*-1=0,\"\", INDEX(D7_01,Y5)*-1)","v":-5},{"$f":"INDEX(D7_02,RN)","v":13},{"$f":"INDEX(D7_03,RN)","v":33}]
[null,null,null,null,null,null,null,null,null,null,null,null,null,null,null,null,null,null,null,null,null,null,null,"5 - 11",{"$f":" IF(INDEX(D8_01,Y5)*-1=0,\"\", INDEX(D8_01,Y5)*-1)","v":-14},{"$f":"INDEX(D8_02,RN)","v":38},{"$f":"INDEX(D8_03,RN)","v":91}]
[null,null,null,null,null,null,null,null,null,null,null,null,null,null,null,null,null,null,null,null,null,null,null,"12 - 17",{"$f":" IF(INDEX(D9_01,RN)*-1=0,\"\",INDEX(D9_01,RN)*-1)","v":-30},{"$f":"INDEX(D9_02,RN)","v":48},{"$f":"INDEX(D9_03,RN)","v":78}]
[null,null,null,null,null,null,null,null,null,null,null,null,null,null,null,null,null,null,null,null,null,null,null,"18 - 35",{"$f":" IF(INDEX(D10_01,RN)*-1=0,\"\",INDEX(D10_01,RN)*-1)","v":-31},{"$f":"INDEX(D10_02,RN)","v":48},{"$f":"INDEX(D10_03,RN)","v":79}]
[null,null,null,null,null,null,null,null,null,null,null,null,null,null,null,null,null,null,null,null,null,null,null,"36 - 59",{"$f":" IF(INDEX(D11_01,RN)*-1=0,\"\",INDEX(D11_01,RN)*-1)","v":-23},{"$f":"INDEX(D11_02,RN)","v":41},{"$f":"INDEX(D11_03,RN)","v":64}]
[null,null,null,null,null,null,null,null,null,null,null,null,null,null,null,null,null,null,null,null,null,null,null,"60 +",{"$f":" IF(INDEX(D12_01,RN)*-1=0,\"\",  INDEX(D12_01,RN)*-1)","v":-6},{"$f":"INDEX(D12_02,RN)","v":16},{"$f":"INDEX(D12_03,RN)","v":22}]
[null,null,null,null,null,null,null,null,null,null,null,null,null,null,null,null,null,null,null,null,null,null,null,"Total",{"$f":" IF(INDEX(D13_01,RN)*-1=0,\"\",INDEX(D13_01,RN)*-1)","v":-180},{"$f":"INDEX(D13_02,RN)","v":214},{"$f":"INDEX(D13_03,RN)","v":394}]
[]
[null,null,null,null,null,null,null,null,null,null,null,null,null,null,null,null,null,null,null,null,null,null,null,"Births in last 6 months",{"$f":" IF(INDEX(D23_01,RN)*-1=0,\"\",INDEX(D23_01,RN)*-1)","v":""},{"$f":"INDEX(D23_02,RS)","v":0},{"$f":"INDEX(D23_03,RS)","v":1}]
[null,null,null,null,null,null,null,null,null,null,null,null,null,null,null,null,null,null,null,null,null,null,null,"Deaths in last 6 months",{"$f":"IF( INDEX(D24_01,RN)*-1=0,\"\",INDEX(D24_01,RN)*-1)","v":""},{"$f":"INDEX(D24_02,RS)","v":0},{"$f":"INDEX(D24_03,RS)","v":0}]
[]
[]
[]
[null,null,null,null,null,null,null,null,null,null,null,null,null,null,null,null,null,null,null,null,null,null,null,"POPULATION LIVING IN THE CAMP, BY VULNERABILITY:"]
[null,null,null,null,null,null,null,null,null,null,null,null,null,null,null,null,null,null,null,null,null,null,null,"Type of Vulnerability","Male","Female","Total"]
[null,null,null,null,null,null,null,null,null,null,null,null,null,null,null,null,null,null,null,null,null,null,null,"Physically Disabled",{"$f":"IF(INDEX(D14_01,RN)*-1=0,\" \",INDEX(D14_01,RN)*-1)","v":-4},{"$f":"INDEX(D14_02,RN)","v":1},{"$f":"INDEX(D14_03,RN)","v":5},null,null,null,"Latrines"]
[null,null,null,null,null,null,null,null,null,null,null,null,null,null,null,null,null,null,null,null,null,null,null,"Mentally Disabled",{"$f":"IF(INDEX(D15_01,RN)*-1=0,\" \",INDEX(D15_01,RN)*-1)","v":-1},{"$f":"INDEX(D15_02,RN)","v":1},{"$f":"INDEX(D15_03,RN)","v":2},null,null,null,"for men",{"$f":"VLOOKUP(Y3,Data!A2:HR800,213,TRUE)","v":0},"for women",{"$f":"VLOOKUP(Y3,Data!A2:HR800,214,TRUE)","v":0}]
[null,null,null,null,null,null,null,null,null,null,null,null,null,null,null,null,null,null,null,null,null,null,null,"Chronically ill",{"$f":"IF(INDEX(D16_01,RN)*-1=0,\"\",INDEX(D16_01,RN)*-1)","v":-1},{"$f":"INDEX(D16_02,RN)","v":3},{"$f":"INDEX(D16_03,RN)","v":4}]
[null,null,null,null,null,null,null,null,null,null,null,null,null,null,null,null,null,null,null,null,null,null,null,"Unaccompanied children (<18)",{"$f":"IF(INDEX(D17_01,RN)*-1=0,\"\",INDEX(D17_01,RN)*-1)","v":""},{"$f":"INDEX(D17_02,RN)","v":0},{"$f":"INDEX(D17_03,RN)","v":0},null,null,null,null,{"$f":"INDEX(Data!A2:HR800,Y5,213)","v":0}]
[null,null,null,null,null,null,null,null,null,null,null,null,null,null,null,null,null,null,null,null,null,null,null,"Separated children (<18)",{"$f":"IF(INDEX(D18_01,RN)*-1=0,\"\",INDEX(D18_01,RN)*-1)","v":""},{"$f":"INDEX(D18_02,RN)","v":0},{"$f":"INDEX(D18_03,RN)","v":0}]
[null,null,null,null,null,null,null,null,null,null,null,null,null,null,null,null,null,null,null,null,null,null,null,"Unaccompanied elders (>60)",{"$f":"IF(INDEX(D19_01,RN)*-1=0,\"\",INDEX(D19_01,RN)*-1)","v":-6},{"$f":"INDEX(D19_02,RN)","v":16},{"$f":"INDEX(D19_03,RN)","v":22}]
[null,null,null,null,null,null,null,null,"Facility / Service","Available within  ",null,"Distance to nearest ACCESSIBLE  and",null,null,null,null,null,null,null,null,null,null,null,"Single headed households",{"$f":"IF(INDEX(D20_01,RN)*-1=0,\"\",INDEX(D20_01,RN)*-1)","v":-1},{"$f":"INDEX(D20_02,RN)","v":4},{"$f":"INDEX(D20_03,RN)","v":5}]
[null,null,null,null,null,null,null,null,null,"the camp? ",null,"FUNCTIONING facility/service   ",null,null,null,null,null,null,null,null,null,null,null,"Pregnant women",null,{"$f":"INDEX(D21_01,RN)","v":7}]
[null,null,null,null,null,null,null,null,null,"Yes","No","Distance (miles)","Time (min)",null,null,null,null,null,null,null,null,null,null,"Lactating women",null,{"$f":"INDEX(D22_01,RN)","v":1}]
[null,null,null,null,null,null,null,null,"Regular market",{"$f":"IF(INDEX(F1_01,RN)=\"Yes\",\"X\",\"\")","v":{"$error":"#REF!"}},{"$f":"IF(INDEX(F1_01,RN)=\"No\",\"X\",\"\")","v":{"$error":"#REF!"}},{"$f":"INDEX(F1_02,RN)","v":0.5},{"$f":"INDEX(F1_03,RN)","v":{"$error":"#REF!"}}]
[null,null,null,null,null,null,null,null,"Drinking water source",{"$f":"IF(INDEX(F2_01,RN)=\"Yes\",\"X\",\"\")","v":{"$error":"#REF!"}},{"$f":"IF(INDEX(F2_01,RN)=\"No\",\"X\",\"\")","v":{"$error":"#REF!"}},{"$f":"INDEX(F2_02,RN)","v":0},{"$f":"INDEX(F2_03,RN)","v":{"$error":"#REF!"}}]
[null,null,null,null,null,null,null,null,"Health facility ",{"$f":"IF(INDEX(F3_01,RN)=\"Yes\",\"X\",\"\")","v":{"$error":"#REF!"}},{"$f":"IF(INDEX(F3_01,RN)=\"No\",\"X\",\"\")","v":{"$error":"#REF!"}},{"$f":"INDEX(F3_02,RN)","v":0},{"$f":"INDEX(F3_03,RN)","v":{"$error":"#REF!"}},null,null,null,null,null,null,null,null,null,null,"Facility / Service","Available within the camp?  ",null,"b) Distance to nearest ACCESSIBLE and FUNCTIONING facility/service                   (answer at least one)"]
[null,null,null,null,null,null,null,null,"Pre-school/nursery",{"$f":"IF(INDEX(F4_01,RN)=\"Yes\",\"X\",\"\")","v":{"$error":"#REF!"}},{"$f":"IF(INDEX(F4_01,RN)=\"No\",\"X\",\"\")","v":{"$error":"#REF!"}},{"$f":"INDEX(F4_02,RN)","v":0.25},{"$f":"INDEX(F4_03,RN)","v":{"$error":"#REF!"}}]
[null,null,null,null,null,null,null,null,"Primary school",{"$f":"IF(INDEX(F5_01,RN)=\"Yes\",\"X\",\"\")","v":{"$error":"#REF!"}},{"$f":"IF(INDEX(F5_01,RN)=\"No\",\"X\",\"\")","v":{"$error":"#REF!"}},{"$f":"INDEX(F5_02,RN)","v":1},{"$f":"INDEX(F5_03,RN)","v":{"$error":"#REF!"}}]
[null,null,null,null,null,null,null,null,"Middle school",{"$f":"IF(INDEX(F6_01,RN)=\"Yes\",\"X\",\"\")","v":{"$error":"#REF!"}},{"$f":"IF(INDEX(F6_01,RN)=\"No\",\"X\",\"\")","v":{"$error":"#REF!"}},{"$f":"INDEX(F6_02,RN)","v":{"$error":"#REF!"}},{"$f":"INDEX(F6_03,RN)","v":{"$error":"#REF!"}},null,null,null,null,null,null,null,null,null,null,null,"Yes","No","Distance (miles)","Time (minutes)"]
[null,null,null,null,null,null,null,null,"High school",{"$f":"IF(INDEX(F7_01,RN)=\"Yes\",\"X\",\"\")","v":{"$error":"#REF!"}},{"$f":"IF(INDEX(F7_01,RN)=\"No\",\"X\",\"\")","v":{"$error":"#REF!"}},{"$f":"INDEX(F7_02,RN)","v":{"$error":"#REF!"}},{"$f":"INDEX(F7_03,RN)","v":{"$error":"#REF!"}},null,null,null,null,null,null,null,null,null,null,"Regular market",{"$f":"IF(INDEX(F1_01,Y5)=AK$125,\"X\",\"\")","v":{"$error":"#REF!"}},{"$f":"IF(INDEX(F1_01,RS)=AP$125,\"X\",\"\")","v":{"$error":"#REF!"}}]
[null,null,null,null,null,null,null,null,null,null,null,null,null,null,null,null,null,null,null,null,null,null,null,"Drinking water source",{"$f":"IF(INDEX(F2_01,RS)=AK$125,\"X\",\"\")","v":{"$error":"#REF!"}},{"$f":"IF(INDEX(F2_01,RS)=AP$125,\"X\",\"\")","v":{"$error":"#REF!"}}]
[null,null,null,null,null,null,null,null,null,null,null,null,null,null,null,null,null,null,null,null,null,null,null,"Health facility ",{"$f":"IF(INDEX(F3_01,RS)=AK$125,\"X\",\"\")","v":{"$error":"#REF!"}},{"$f":"IF(INDEX(F3_01,RS)=AP$125,\"X\",\"\")","v":{"$error":"#REF!"}}]
[null,null,null,null,null,null,null,null,null,null,null,null,null,null,null,null,null,null,null,null,null,null,null,"Pre-school/nursery",{"$f":"IF(INDEX(F4_01,RS)=AK$125,\"X\",\"\")","v":{"$error":"#REF!"}},{"$f":"IF(INDEX(F4_01,RS)=AP$125,\"X\",\"\")","v":{"$error":"#REF!"}}]
[null,null,null,null,null,null,null,null,null,null,null,null,null,null,null,null,null,null,null,null,null,null,null,"Primary school",{"$f":"IF(INDEX(F5_01,RS)=AK$125,\"X\",\"\")","v":{"$error":"#REF!"}},{"$f":"IF(INDEX(F5_01,RS)=AP$125,\"X\",\"\")","v":{"$error":"#REF!"}}]
[null,null,null,null,null,null,null,null,null,null,null,null,null,null,null,null,null,null,null,null,null,null,null,"Middle school",{"$f":"IF(INDEX(F6_01,RS)=AK$125,\"X\",\"\")","v":{"$error":"#REF!"}},{"$f":"IF(INDEX(F6_01,RS)=AP$125,\"X\",\"\")","v":{"$error":"#REF!"}}]
[null,null,null,null,null,null,null,null,null,null,null,null,null,null,null,null,null,null,null,null,null,null,null,"High school",{"$f":"IF(INDEX(F7_01,RS)=AK$125,\"X\",\"\")","v":{"$error":"#REF!"}},{"$f":"IF(INDEX(F7_01,RS)=AP$125,\"X\",\"\")","v":{"$error":"#REF!"}}]
[]
[]
[]
[]
[]
[]
[]
[]
[]
[]
[]
[]
[]
[]
[]
[]
[]
[]
[]
[]
[]
[]
[]
[]
[]
[]
[]
[]
[]
[]
[]
[null,null,null,null,null,null,null,null,null,null,null,null,null,null,null,null,null,null,""]

{"sheet":"InfoGraph data","index":4,"n_rows":7,"n_cols":9,"rows_kept":7,"cut":false,"hidden":false,"merged":[]}
[]
[]
[]
[]
[]
[null,null,null,null,null,"POPULATION LIVING IN THE CAMP, BY AGE GROUPS:"]
[null,null,null,null,null,"Age (Years)","Male","Female","Total"]

{"sheet":"Analysis Charts","index":5,"n_rows":0,"n_cols":0,"rows_kept":0,"cut":false,"hidden":false,"merged":[]}

{"sheet":"Analysis Tables","index":6,"n_rows":101,"n_cols":33,"rows_kept":101,"cut":false,"hidden":false,"merged":[[99,13,99,14],[7,13,25,13],[26,13,50,13],[51,13,51,14],[55,13,73,13],[74,13,98,13]]}
[]
[]
[]
[]
[]
[null,"KACHIN CAMP POPULATIONS",null,null,null,null,null,"SHAN (NORTH) CAMP POPULATIONS",null,null,null,null,null,"DEMOGRAPHICS"]
[null,"Townships","Total Number of Camps","Total Number of Households","Total Number of individuals",null,null,"Townships","Total Number of Camps","Total Number of Households","Total Number of individuals",null,null,"State","Townships","0 to 5 months ","6 to 23 months ","2 to 4 years ","5 to 11 years ","12 to 17 years ","18 to 35 years ","36 to 59 years  ","60 years and above ","Male  total","0 to 5 months ","6 to 23 months ","2 to 4 years ","5 to 11 years ","12 to 17 years ","18 to 35 years ","36 to 59 years  ","60 years and above ","Female  total"]
[null,"Momauk",{"$f":"COUNTIF(Data!R:R,B8)","v":14},{"$f":"SUMIF(Data!R:R,'Analysis Tables'!B8,Data!DG:DG)","v":4066},{"$f":"SUMIF(Data!R:R,'Analysis Tables'!B8,Data!DH:DH)","v":19493},null,null,"Namphan",{"$f":"COUNTIF(Data!R:R,H8)","v":0},{"$f":"SUMIF(Data!R:R,'Analysis Tables'!H8,Data!DG:DG)","v":0},{"$f":"SUMIF(Data!R:R,'Analysis Tables'!H8,Data!DH:DH)","v":0},null,null,"Kachin","Momauk",{"$f":"SUMIF(Data!$R:$R,$O8,Data!BC:BC)","v":220},{"$f":"SUMIF(Data!$R:$R,$O8,Data!BF:BF)","v":398},{"$f":"SUMIF(Data!$R:$R,$O8,Data!BI:BI)","v":786},{"$f":"SUMIF(Data!$R:$R,$O8,Data!BL:BL)","v":2153},{"$f":"SUMIF(Data!$R:$R,$O8,Data!BO:BO)","v":1726},{"$f":"SUMIF(Data!$R:$R,$O8,Data!BR:BR)","v":1964},{"$f":"SUMIF(Data!$R:$R,$O8,Data!BU:BU)","v":1758},{"$f":"SUMIF(Data!$R:$R,$O8,Data!BX:BX)","v":481},{"$f":"SUMIF(Data!$R:$R,$O8,Data!CA:CA)","v":9486},{"$f":"SUMIF(Data!$R:$R,$O8,Data!BD:BD)","v":241},{"$f":"SUMIF(Data!$R:$R,$O8,Data!BG:BG)","v":390},{"$f":"SUMIF(Data!$R:$R,$O8,Data!BJ:BJ)","v":836},{"$f":"SUMIF(Data!$R:$R,$O8,Data!BM:BM)","v":1955},{"$f":"SUMIF(Data!$R:$R,$O8,Data!BP:BP)","v":1729},{"$f":"SUMIF(Data!$R:$R,$O8,Data!BS:BS)","v":2216},{"$f":"SUMIF(Data!$R:$R,$O8,Data!BV:BV)","v":2158},{"$f":"SUMIF(Data!$R:$R,$O8,Data!BY:BY)","v":684},{"$f":"SUMIF(Data!$R:$R,$O8,Data!CB:CB)","v":10209}]
[null,"Mogaung",{"$f":"COUNTIF(Data!R:R,B9)","v":3},{"$f":"SUMIF(Data!R:R,'Analysis Tables'!B9,Data!DG:DG)","v":39},{"$f":"SUMIF(Data!R:R,'Analysis Tables'!B9,Data!DH:DH)","v":148},null,null,"Nawnghkio",{"$f":"COUNTIF(Data!R:R,H9)","v":0},{"$f":"SUMIF(Data!R:R,'Analysis Tables'!H9,Data!DG:DG)","v":0},{"$f":"SUMIF(Data!R:R,'Analysis Tables'!H9,Data!DH:DH)","v":0},null,null,null,"Mogaung",{"$f":"SUMIF(Data!$R:$R,$O9,Data!BC:BC)","v":1},{"$f":"SUMIF(Data!$R:$R,$O9,Data!BF:BF)","v":8},{"$f":"SUMIF(Data!$R:$R,$O9,Data!BI:BI)","v":14},{"$f":"SUMIF(Data!$R:$R,$O9,Data!BL:BL)","v":28},{"$f":"SUMIF(Data!$R:$R,$O9,Data!BO:BO)","v":9},{"$f":"SUMIF(Data!$R:$R,$O9,Data!BR:BR)","v":3},{"$f":"SUMIF(Data!$R:$R,$O9,Data!BU:BU)","v":3},{"$f":"SUMIF(Data!$R:$R,$O9,Data!BX:BX)","v":2},{"$f":"SUMIF(Data!$R:$R,$O9,Data!CA:CA)","v":68},{"$f":"SUMIF(Data!$R:$R,$O9,Data!BD:BD)","v":0},{"$f":"SUMIF(Data!$R:$R,$O9,Data!BG:BG)","v":3},{"$f":"SUMIF(Data!$R:$R,$O9,Data!BJ:BJ)","v":8},{"$f":"SUMIF(Data!$R:$R,$O9,Data!BM:BM)","v":11},{"$f":"SUMIF(Data!$R:$R,$O9,Data!BP:BP)","v":15},{"$f":"SUMIF(Data!$R:$R,$O9,Data!BS:BS)","v":16},{"$f":"SUMIF(Data!$R:$R,$O9,Data!BV:BV)","v":13},{"$f":"SUMIF(Data!$R:$R,$O9,Data!BY:BY)","v":4},{"$f":"SUMIF(Data!$R:$R,$O9,Data!CB:CB)","v":70}]
[null,"Chipwi",{"$f":"COUNTIF(Data!R:R,B10)","v":3},{"$f":"SUMIF(Data!R:R,'Analysis Tables'!B10,Data!DG:DG)","v":382},{"$f":"SUMIF(Data!R:R,'Analysis Tables'!B10,Data!DH:DH)","v":1789},null,null,"Mongyai",{"$f":"COUNTIF(Data!R:R,H10)","v":0},{"$f":"SUMIF(Data!R:R,'Analysis Tables'!H10,Data!DG:DG)","v":0},{"$f":"SUMIF(Data!R:R,'Analysis Tables'!H10,Data!DH:DH)","v":0},null,null,null,"Chipwi",{"$f":"SUMIF(Data!$R:$R,$O10,Data!BC:BC)","v":6},{"$f":"SUMIF(Data!$R:$R,$O10,Data!BF:BF)","v":45},{"$f":"SUMIF(Data!$R:$R,$O10,Data!BI:BI)","v":85},{"$f":"SUMIF(Data!$R:$R,$O10,Data!BL:BL)","v":188},{"$f":"SUMIF(Data!$R:$R,$O10,Data!BO:BO)","v":156},{"$f":"SUMIF(Data!$R:$R,$O10,Data!BR:BR)","v":186},{"$f":"SUMIF(Data!$R:$R,$O10,Data!BU:BU)","v":162},{"$f":"SUMIF(Data!$R:$R,$O10,Data!BX:BX)","v":73},{"$f":"SUMIF(Data!$R:$R,$O10,Data!CA:CA)","v":901},{"$f":"SUMIF(Data!$R:$R,$O10,Data!BD:BD)","v":17},{"$f":"SUMIF(Data!$R:$R,$O10,Data!BG:BG)","v":25},{"$f":"SUMIF(Data!$R:$R,$O10,Data!BJ:BJ)","v":75},{"$f":"SUMIF(Data!$R:$R,$O10,Data!BM:BM)","v":156},{"$f":"SUMIF(Data!$R:$R,$O10,Data!BP:BP)","v":141},{"$f":"SUMIF(Data!$R:$R,$O10,Data!BS:BS)","v":182},{"$f":"SUMIF(Data!$R:$R,$O10,Data!BV:BV)","v":179},{"$f":"SUMIF(Data!$R:$R,$O10,Data!BY:BY)","v":107},{"$f":"SUMIF(Data!$R:$R,$O10,Data!CB:CB)","v":882}]
[null,"Sumprabum",{"$f":"COUNTIF(Data!R:R,B11)","v":0},{"$f":"SUMIF(Data!R:R,'Analysis Tables'!B11,Data!DG:DG)","v":0},{"$f":"SUMIF(Data!R:R,'Analysis Tables'!B11,Data!DH:DH)","v":0},null,null,"Namhsan",{"$f":"COUNTIF(Data!R:R,H11)","v":0},{"$f":"SUMIF(Data!R:R,'Analysis Tables'!H11,Data!DG:DG)","v":0},{"$f":"SUMIF(Data!R:R,'Analysis Tables'!H11,Data!DH:DH)","v":0},null,null,null,"Sumprabum",{"$f":"SUMIF(Data!$R:$R,$O11,Data!BC:BC)","v":0},{"$f":"SUMIF(Data!$R:$R,$O11,Data!BF:BF)","v":0},{"$f":"SUMIF(Data!$R:$R,$O11,Data!BI:BI)","v":0},{"$f":"SUMIF(Data!$R:$R,$O11,Data!BL:BL)","v":0},{"$f":"SUMIF(Data!$R:$R,$O11,Data!BO:BO)","v":0},{"$f":"SUMIF(Data!$R:$R,$O11,Data!BR:BR)","v":0},{"$f":"SUMIF(Data!$R:$R,$O11,Data!BU:BU)","v":0},{"$f":"SUMIF(Data!$R:$R,$O11,Data!BX:BX)","v":0},{"$f":"SUMIF(Data!$R:$R,$O11,Data!CA:CA)","v":0},{"$f":"SUMIF(Data!$R:$R,$O11,Data!BD:BD)","v":0},{"$f":"SUMIF(Data!$R:$R,$O11,Data!BG:BG)","v":0},{"$f":"SUMIF(Data!$R:$R,$O11,Data!BJ:BJ)","v":0},{"$f":"SUMIF(Data!$R:$R,$O11,Data!BM:BM)","v":0},{"$f":"SUMIF(Data!$R:$R,$O11,Data!BP:BP)","v":0},{"$f":"SUMIF(Data!$R:$R,$O11,Data!BS:BS)","v":0},{"$f":"SUMIF(Data!$R:$R,$O11,Data!BV:BV)","v":0},{"$f":"SUMIF(Data!$R:$R,$O11,Data!BY:BY)","v":0},{"$f":"SUMIF(Data!$R:$R,$O11,Data!CB:CB)","v":0}]
[null,"Nawngmun",{"$f":"COUNTIF(Data!R:R,B12)","v":0},{"$f":"SUMIF(Data!R:R,'Analysis Tables'!B12,Data!DG:DG)","v":0},{"$f":"SUMIF(Data!R:R,'Analysis Tables'!B12,Data!DH:DH)","v":0},null,null,"Hseni",{"$f":"COUNTIF(Data!R:R,H12)","v":1},{"$f":"SUMIF(Data!R:R,'Analysis Tables'!H12,Data!DG:DG)","v":50},{"$f":"SUMIF(Data!R:R,'Analysis Tables'!H12,Data!DH:DH)","v":258},null,null,null,"Nawngmun",{"$f":"SUMIF(Data!$R:$R,$O12,Data!BC:BC)","v":0},{"$f":"SUMIF(Data!$R:$R,$O12,Data!BF:BF)","v":0},{"$f":"SUMIF(Data!$R:$R,$O12,Data!BI:BI)","v":0},{"$f":"SUMIF(Data!$R:$R,$O12,Data!BL:BL)","v":0},{"$f":"SUMIF(Data!$R:$R,$O12,Data!BO:BO)","v":0},{"$f":"SUMIF(Data!$R:$R,$O12,Data!BR:BR)","v":0},{"$f":"SUMIF(Data!$R:$R,$O12,Data!BU:BU)","v":0},{"$f":"SUMIF(Data!$R:$R,$O12,Data!BX:BX)","v":0},{"$f":"SUMIF(Data!$R:$R,$O12,Data!CA:CA)","v":0},{"$f":"SUMIF(Data!$R:$R,$O12,Data!BD:BD)","v":0},{"$f":"SUMIF(Data!$R:$R,$O12,Data!BG:BG)","v":0},{"$f":"SUMIF(Data!$R:$R,$O12,Data!BJ:BJ)","v":0},{"$f":"SUMIF(Data!$R:$R,$O12,Data!BM:BM)","v":0},{"$f":"SUMIF(Data!$R:$R,$O12,Data!BP:BP)","v":0},{"$f":"SUMIF(Data!$R:$R,$O12,Data!BS:BS)","v":0},{"$f":"SUMIF(Data!$R:$R,$O12,Data!BV:BV)","v":0},{"$f":"SUMIF(Data!$R:$R,$O12,Data!BY:BY)","v":0},{"$f":"SUMIF(Data!$R:$R,$O12,Data!CB:CB)","v":0}]
[null,"Mansi",{"$f":"COUNTIF(Data!R:R,B13)","v":9},{"$f":"SUMIF(Data!R:R,'Analysis Tables'!B13,Data!DG:DG)","v":1715},{"$f":"SUMIF(Data!R:R,'Analysis Tables'!B13,Data!DH:DH)","v":6580},null,null,"Laukkaing",{"$f":"COUNTIF(Data!R:R,H13)","v":0},{"$f":"SUMIF(Data!R:R,'Analysis Tables'!H13,Data!DG:DG)","v":0},{"$f":"SUMIF(Data!R:R,'Analysis Tables'!H13,Data!DH:DH)","v":0},null,null,null,"Mansi",{"$f":"SUMIF(Data!$R:$R,$O13,Data!BC:BC)","v":66},{"$f":"SUMIF(Data!$R:$R,$O13,Data!BF:BF)","v":115},{"$f":"SUMIF(Data!$R:$R,$O13,Data!BI:BI)","v":372},{"$f":"SUMIF(Data!$R:$R,$O13,Data!BL:BL)","v":1149},{"$f":"SUMIF(Data!$R:$R,$O13,Data!BO:BO)","v":750},{"$f":"SUMIF(Data!$R:$R,$O13,Data!BR:BR)","v":553},{"$f":"SUMIF(Data!$R:$R,$O13,Data!BU:BU)","v":541},{"$f":"SUMIF(Data!$R:$R,$O13,Data!BX:BX)","v":192},{"$f":"SUMIF(Data!$R:$R,$O13,Data!CA:CA)","v":3738},{"$f":"SUMIF(Data!$R:$R,$O13,Data!BD:BD)","v":75},{"$f":"SUMIF(Data!$R:$R,$O13,Data!BG:BG)","v":150},{"$f":"SUMIF(Data!$R:$R,$O13,Data!BJ:BJ)","v":378},{"$f":"SUMIF(Data!$R:$R,$O13,Data!BM:BM)","v":1044},{"$f":"SUMIF(Data!$R:$R,$O13,Data!BP:BP)","v":781},{"$f":"SUMIF(Data!$R:$R,$O13,Data!BS:BS)","v":901},{"$f":"SUMIF(Data!$R:$R,$O13,Data!BV:BV)","v":835},{"$f":"SUMIF(Data!$R:$R,$O13,Data!BY:BY)","v":272},{"$f":"SUMIF(Data!$R:$R,$O13,Data!CB:CB)","v":4436}]
[null,"Myitkyina",{"$f":"COUNTIF(Data!R:R,B14)","v":25},{"$f":"SUMIF(Data!R:R,'Analysis Tables'!B14,Data!DG:DG)","v":1380},{"$f":"SUMIF(Data!R:R,'Analysis Tables'!B14,Data!DH:DH)","v":6393},null,null,"Muse",{"$f":"COUNTIF(Data!R:R,H14)","v":1},{"$f":"SUMIF(Data!R:R,'Analysis Tables'!H14,Data!DG:DG)","v":27},{"$f":"SUMIF(Data!R:R,'Analysis Tables'!H14,Data!DH:DH)","v":99},null,null,null,"Myitkyina",{"$f":"SUMIF(Data!$R:$R,$O14,Data!BC:BC)","v":30},{"$f":"SUMIF(Data!$R:$R,$O14,Data!BF:BF)","v":118},{"$f":"SUMIF(Data!$R:$R,$O14,Data!BI:BI)","v":241},{"$f":"SUMIF(Data!$R:$R,$O14,Data!BL:BL)","v":606},{"$f":"SUMIF(Data!$R:$R,$O14,Data!BO:BO)","v":567},{"$f":"SUMIF(Data!$R:$R,$O14,Data!BR:BR)","v":633},{"$f":"SUMIF(Data!$R:$R,$O14,Data!BU:BU)","v":465},{"$f":"SUMIF(Data!$R:$R,$O14,Data!BX:BX)","v":197},{"$f":"SUMIF(Data!$R:$R,$O14,Data!CA:CA)","v":2857},{"$f":"SUMIF(Data!$R:$R,$O14,Data!BD:BD)","v":28},{"$f":"SUMIF(Data!$R:$R,$O14,Data!BG:BG)","v":94},{"$f":"SUMIF(Data!$R:$R,$O14,Data!BJ:BJ)","v":265},{"$f":"SUMIF(Data!$R:$R,$O14,Data!BM:BM)","v":571},{"$f":"SUMIF(Data!$R:$R,$O14,Data!BP:BP)","v":673},{"$f":"SUMIF(Data!$R:$R,$O14,Data!BS:BS)","v":770},{"$f":"SUMIF(Data!$R:$R,$O14,Data!BV:BV)","v":668},{"$f":"SUMIF(Data!$R:$R,$O14,Data!BY:BY)","v":270},{"$f":"SUMIF(Data!$R:$R,$O14,Data!CB:CB)","v":3339}]
[null,"Khaunglanhpu",{"$f":"COUNTIF(Data!R:R,B15)","v":0},{"$f":"SUMIF(Data!R:R,'Analysis Tables'!B15,Data!DG:DG)","v":0},{"$f":"SUMIF(Data!R:R,'Analysis Tables'!B15,Data!DH:DH)","v":0},null,null,"Mabein",{"$f":"COUNTIF(Data!R:R,H15)","v":0},{"$f":"SUMIF(Data!R:R,'Analysis Tables'!H15,Data!DG:DG)","v":0},{"$f":"SUMIF(Data!R:R,'Analysis Tables'!H15,Data!DH:DH)","v":0},null,null,null,"Khaunglanhpu",{"$f":"SUMIF(Data!$R:$R,$O15,Data!BC:BC)","v":0},{"$f":"SUMIF(Data!$R:$R,$O15,Data!BF:BF)","v":0},{"$f":"SUMIF(Data!$R:$R,$O15,Data!BI:BI)","v":0},{"$f":"SUMIF(Data!$R:$R,$O15,Data!BL:BL)","v":0},{"$f":"SUMIF(Data!$R:$R,$O15,Data!BO:BO)","v":0},{"$f":"SUMIF(Data!$R:$R,$O15,Data!BR:BR)","v":0},{"$f":"SUMIF(Data!$R:$R,$O15,Data!BU:BU)","v":0},{"$f":"SUMIF(Data!$R:$R,$O15,Data!BX:BX)","v":0},{"$f":"SUMIF(Data!$R:$R,$O15,Data!CA:CA)","v":0},{"$f":"SUMIF(Data!$R:$R,$O15,Data!BD:BD)","v":0},{"$f":"SUMIF(Data!$R:$R,$O15,Data!BG:BG)","v":0},{"$f":"SUMIF(Data!$R:$R,$O15,Data!BJ:BJ)","v":0},{"$f":"SUMIF(Data!$R:$R,$O15,Data!BM:BM)","v":0},{"$f":"SUMIF(Data!$R:$R,$O15,Data!BP:BP)","v":0},{"$f":"SUMIF(Data!$R:$R,$O15,Data!BS:BS)","v":0},{"$f":"SUMIF(Data!$R:$R,$O15,Data!BV:BV)","v":0},{"$f":"SUMIF(Data!$R:$R,$O15,Data!BY:BY)","v":0},{"$f":"SUMIF(Data!$R:$R,$O15,Data!CB:CB)","v":0}]
[null,"Puta-O",{"$f":"COUNTIF(Data!R:R,B16)","v":0},{"$f":"SUMIF(Data!R:R,'Analysis Tables'!B16,Data!DG:DG)","v":0},{"$f":"SUMIF(Data!R:R,'Analysis Tables'!B16,Data!DH:DH)","v":0},null,null,"Kyaukme",{"$f":"COUNTIF(Data!R:R,H16)","v":0},{"$f":"SUMIF(Data!R:R,'Analysis Tables'!H16,Data!DG:DG)","v":0},{"$f":"SUMIF(Data!R:R,'Analysis Tables'!H16,Data!DH:DH)","v":0},null,null,null,"Puta-O",{"$f":"SUMIF(Data!$R:$R,$O16,Data!BC:BC)","v":0},{"$f":"SUMIF(Data!$R:$R,$O16,Data!BF:BF)","v":0},{"$f":"SUMIF(Data!$R:$R,$O16,Data!BI:BI)","v":0},{"$f":"SUMIF(Data!$R:$R,$O16,Data!BL:BL)","v":0},{"$f":"SUMIF(Data!$R:$R,$O16,Data!BO:BO)","v":0},{"$f":"SUMIF(Data!$R:$R,$O16,Data!BR:BR)","v":0},{"$f":"SUMIF(Data!$R:$R,$O16,Data!BU:BU)","v":0},{"$f":"SUMIF(Data!$R:$R,$O16,Data!BX:BX)","v":0},{"$f":"SUMIF(Data!$R:$R,$O16,Data!CA:CA)","v":0},{"$f":"SUMIF(Data!$R:$R,$O16,Data!BD:BD)","v":0},{"$f":"SUMIF(Data!$R:$R,$O16,Data!BG:BG)","v":0},{"$f":"SUMIF(Data!$R:$R,$O16,Data!BJ:BJ)","v":0},{"$f":"SUMIF(Data!$R:$R,$O16,Data!BM:BM)","v":0},{"$f":"SUMIF(Data!$R:$R,$O16,Data!BP:BP)","v":0},{"$f":"SUMIF(Data!$R:$R,$O16,Data!BS:BS)","v":0},{"$f":"SUMIF(Data!$R:$R,$O16,Data!BV:BV)","v":0},{"$f":"SUMIF(Data!$R:$R,$O16,Data!BY:BY)","v":0},{"$f":"SUMIF(Data!$R:$R,$O16,Data!CB:CB)","v":0}]
[null,"Shwegu",{"$f":"COUNTIF(Data!R:R,B17)","v":2},{"$f":"SUMIF(Data!R:R,'Analysis Tables'!B17,Data!DG:DG)","v":98},{"$f":"SUMIF(Data!R:R,'Analysis Tables'!B17,Data!DH:DH)","v":428},null,null,"Lashio",{"$f":"COUNTIF(Data!R:R,H17)","v":0},{"$f":"SUMIF(Data!R:R,'Analysis Tables'!H17,Data!DG:DG)","v":0},{"$f":"SUMIF(Data!R:R,'Analysis Tables'!H17,Data!DH:DH)","v":0},null,null,null,"Shwegu",{"$f":"SUMIF(Data!$R:$R,$O17,Data!BC:BC)","v":0},{"$f":"SUMIF(Data!$R:$R,$O17,Data!BF:BF)","v":8},{"$f":"SUMIF(Data!$R:$R,$O17,Data!BI:BI)","v":24},{"$f":"SUMIF(Data!$R:$R,$O17,Data!BL:BL)","v":39},{"$f":"SUMIF(Data!$R:$R,$O17,Data!BO:BO)","v":58},{"$f":"SUMIF(Data!$R:$R,$O17,Data!BR:BR)","v":31},{"$f":"SUMIF(Data!$R:$R,$O17,Data!BU:BU)","v":18},{"$f":"SUMIF(Data!$R:$R,$O17,Data!BX:BX)","v":3},{"$f":"SUMIF(Data!$R:$R,$O17,Data!CA:CA)","v":181},{"$f":"SUMIF(Data!$R:$R,$O17,Data!BD:BD)","v":0},{"$f":"SUMIF(Data!$R:$R,$O17,Data!BG:BG)","v":14},{"$f":"SUMIF(Data!$R:$R,$O17,Data!BJ:BJ)","v":20},{"$f":"SUMIF(Data!$R:$R,$O17,Data!BM:BM)","v":45},{"$f":"SUMIF(Data!$R:$R,$O17,Data!BP:BP)","v":29},{"$f":"SUMIF(Data!$R:$R,$O17,Data!BS:BS)","v":55},{"$f":"SUMIF(Data!$R:$R,$O17,Data!BV:BV)","v":31},{"$f":"SUMIF(Data!$R:$R,$O17,Data!BY:BY)","v":6},{"$f":"SUMIF(Data!$R:$R,$O17,Data!CB:CB)","v":200}]
[null,"Injangyang",{"$f":"COUNTIF(Data!R:R,B18)","v":0},{"$f":"SUMIF(Data!R:R,'Analysis Tables'!B18,Data!DG:DG)","v":0},{"$f":"SUMIF(Data!R:R,'Analysis Tables'!B18,Data!DH:DH)","v":0},null,null,"Kunlong",{"$f":"COUNTIF(Data!R:R,H18)","v":0},{"$f":"SUMIF(Data!R:R,'Analysis Tables'!H18,Data!DG:DG)","v":0},{"$f":"SUMIF(Data!R:R,'Analysis Tables'!H18,Data!DH:DH)","v":0},null,null,null,"Injangyang",{"$f":"SUMIF(Data!$R:$R,$O18,Data!BC:BC)","v":0},{"$f":"SUMIF(Data!$R:$R,$O18,Data!BF:BF)","v":0},{"$f":"SUMIF(Data!$R:$R,$O18,Data!BI:BI)","v":0},{"$f":"SUMIF(Data!$R:$R,$O18,Data!BL:BL)","v":0},{"$f":"SUMIF(Data!$R:$R,$O18,Data!BO:BO)","v":0},{"$f":"SUMIF(Data!$R:$R,$O18,Data!BR:BR)","v":0},{"$f":"SUMIF(Data!$R:$R,$O18,Data!BU:BU)","v":0},{"$f":"SUMIF(Data!$R:$R,$O18,Data!BX:BX)","v":0},{"$f":"SUMIF(Data!$R:$R,$O18,Data!CA:CA)","v":0},{"$f":"SUMIF(Data!$R:$R,$O18,Data!BD:BD)","v":0},{"$f":"SUMIF(Data!$R:$R,$O18,Data!BG:BG)","v":0},{"$f":"SUMIF(Data!$R:$R,$O18,Data!BJ:BJ)","v":0},{"$f":"SUMIF(Data!$R:$R,$O18,Data!BM:BM)","v":0},{"$f":"SUMIF(Data!$R:$R,$O18,Data!BP:BP)","v":0},{"$f":"SUMIF(Data!$R:$R,$O18,Data!BS:BS)","v":0},{"$f":"SUMIF(Data!$R:$R,$O18,Data!BV:BV)","v":0},{"$f":"SUMIF(Data!$R:$R,$O18,Data!BY:BY)","v":0},{"$f":"SUMIF(Data!$R:$R,$O18,Data!CB:CB)","v":0}]
[null,"Tanai",{"$f":"COUNTIF(Data!R:R,B19)","v":0},{"$f":"SUMIF(Data!R:R,'Analysis Tables'!B19,Data!DG:DG)","v":0},{"$f":"SUMIF(Data!R:R,'Analysis Tables'!B19,Data!DH:DH)","v":0},null,null,"Matman",{"$f":"COUNTIF(Data!R:R,H19)","v":0},{"$f":"SUMIF(Data!R:R,'Analysis Tables'!H19,Data!DG:DG)","v":0},{"$f":"SUMIF(Data!R:R,'Analysis Tables'!H19,Data!DH:DH)","v":0},null,null,null,"Tanai",{"$f":"SUMIF(Data!$R:$R,$O19,Data!BC:BC)","v":0},{"$f":"SUMIF(Data!$R:$R,$O19,Data!BF:BF)","v":0},{"$f":"SUMIF(Data!$R:$R,$O19,Data!BI:BI)","v":0},{"$f":"SUMIF(Data!$R:$R,$O19,Data!BL:BL)","v":0},{"$f":"SUMIF(Data!$R:$R,$O19,Data!BO:BO)","v":0},{"$f":"SUMIF(Data!$R:$R,$O19,Data!BR:BR)","v":0},{"$f":"SUMIF(Data!$R:$R,$O19,Data!BU:BU)","v":0},{"$f":"SUMIF(Data!$R:$R,$O19,Data!BX:BX)","v":0},{"$f":"SUMIF(Data!$R:$R,$O19,Data!CA:CA)","v":0},{"$f":"SUMIF(Data!$R:$R,$O19,Data!BD:BD)","v":0},{"$f":"SUMIF(Data!$R:$R,$O19,Data!BG:BG)","v":0},{"$f":"SUMIF(Data!$R:$R,$O19,Data!BJ:BJ)","v":0},{"$f":"SUMIF(Data!$R:$R,$O19,Data!BM:BM)","v":0},{"$f":"SUMIF(Data!$R:$R,$O19,Data!BP:BP)","v":0},{"$f":"SUMIF(Data!$R:$R,$O19,Data!BS:BS)","v":0},{"$f":"SUMIF(Data!$R:$R,$O19,Data!BV:BV)","v":0},{"$f":"SUMIF(Data!$R:$R,$O19,Data!BY:BY)","v":0},{"$f":"SUMIF(Data!$R:$R,$O19,Data!CB:CB)","v":0}]
[null,"Bhamo",{"$f":"COUNTIF(Data!R:R,B20)","v":10},{"$f":"SUMIF(Data!R:R,'Analysis Tables'!B20,Data!DG:DG)","v":935},{"$f":"SUMIF(Data!R:R,'Analysis Tables'!B20,Data!DH:DH)","v":5033},null,null,"Namtu",{"$f":"COUNTIF(Data!R:R,H20)","v":1},{"$f":"SUMIF(Data!R:R,'Analysis Tables'!H20,Data!DG:DG)","v":16},{"$f":"SUMIF(Data!R:R,'Analysis Tables'!H20,Data!DH:DH)","v":66},null,null,null,"Bhamo",{"$f":"SUMIF(Data!$R:$R,$O20,Data!BC:BC)","v":50},{"$f":"SUMIF(Data!$R:$R,$O20,Data!BF:BF)","v":142},{"$f":"SUMIF(Data!$R:$R,$O20,Data!BI:BI)","v":214},{"$f":"SUMIF(Data!$R:$R,$O20,Data!BL:BL)","v":458},{"$f":"SUMIF(Data!$R:$R,$O20,Data!BO:BO)","v":324},{"$f":"SUMIF(Data!$R:$R,$O20,Data!BR:BR)","v":709},{"$f":"SUMIF(Data!$R:$R,$O20,Data!BU:BU)","v":390},{"$f":"SUMIF(Data!$R:$R,$O20,Data!BX:BX)","v":136},{"$f":"SUMIF(Data!$R:$R,$O20,Data!CA:CA)","v":2423},{"$f":"SUMIF(Data!$R:$R,$O20,Data!BD:BD)","v":39},{"$f":"SUMIF(Data!$R:$R,$O20,Data!BG:BG)","v":140},{"$f":"SUMIF(Data!$R:$R,$O20,Data!BJ:BJ)","v":215},{"$f":"SUMIF(Data!$R:$R,$O20,Data!BM:BM)","v":446},{"$f":"SUMIF(Data!$R:$R,$O20,Data!BP:BP)","v":326},{"$f":"SUMIF(Data!$R:$R,$O20,Data!BS:BS)","v":781},{"$f":"SUMIF(Data!$R:$R,$O20,Data!BV:BV)","v":443},{"$f":"SUMIF(Data!$R:$R,$O20,Data!BY:BY)","v":222},{"$f":"SUMIF(Data!$R:$R,$O20,Data!CB:CB)","v":2612}]
[null,"Mohnyin",{"$f":"COUNTIF(Data!R:R,B21)","v":1},{"$f":"SUMIF(Data!R:R,'Analysis Tables'!B21,Data!DG:DG)","v":21},{"$f":"SUMIF(Data!R:R,'Analysis Tables'!B21,Data!DH:DH)","v":97},null,null,"Mongmit",{"$f":"COUNTIF(Data!R:R,H21)","v":0},{"$f":"SUMIF(Data!R:R,'Analysis Tables'!H21,Data!DG:DG)","v":0},{"$f":"SUMIF(Data!R:R,'Analysis Tables'!H21,Data!DH:DH)","v":0},null,null,null,"Mohnyin",{"$f":"SUMIF(Data!$R:$R,$O21,Data!BC:BC)","v":0},{"$f":"SUMIF(Data!$R:$R,$O21,Data!BF:BF)","v":1},{"$f":"SUMIF(Data!$R:$R,$O21,Data!BI:BI)","v":5},{"$f":"SUMIF(Data!$R:$R,$O21,Data!BL:BL)","v":20},{"$f":"SUMIF(Data!$R:$R,$O21,Data!BO:BO)","v":8},{"$f":"SUMIF(Data!$R:$R,$O21,Data!BR:BR)","v":4},{"$f":"SUMIF(Data!$R:$R,$O21,Data!BU:BU)","v":7},{"$f":"SUMIF(Data!$R:$R,$O21,Data!BX:BX)","v":2},{"$f":"SUMIF(Data!$R:$R,$O21,Data!CA:CA)","v":47},{"$f":"SUMIF(Data!$R:$R,$O21,Data!BD:BD)","v":0},{"$f":"SUMIF(Data!$R:$R,$O21,Data!BG:BG)","v":0},{"$f":"SUMIF(Data!$R:$R,$O21,Data!BJ:BJ)","v":7},{"$f":"SUMIF(Data!$R:$R,$O21,Data!BM:BM)","v":10},{"$f":"SUMIF(Data!$R:$R,$O21,Data!BP:BP)","v":12},{"$f":"SUMIF(Data!$R:$R,$O21,Data!BS:BS)","v":9},{"$f":"SUMIF(Data!$R:$R,$O21,Data!BV:BV)","v":11},{"$f":"SUMIF(Data!$R:$R,$O21,Data!BY:BY)","v":1},{"$f":"SUMIF(Data!$R:$R,$O21,Data!CB:CB)","v":50}]
[null,"Waingmaw",{"$f":"COUNTIF(Data!R:R,B22)","v":21},{"$f":"SUMIF(Data!R:R,'Analysis Tables'!B22,Data!DG:DG)","v":4512},{"$f":"SUMIF(Data!R:R,'Analysis Tables'!B22,Data!DH:DH)","v":20897},null,null,"Kutkai",{"$f":"COUNTIF(Data!R:R,H22)","v":8},{"$f":"SUMIF(Data!R:R,'Analysis Tables'!H22,Data!DG:DG)","v":491},{"$f":"SUMIF(Data!R:R,'Analysis Tables'!H22,Data!DH:DH)","v":2381},null,null,null,"Waingmaw",{"$f":"SUMIF(Data!$R:$R,$O22,Data!BC:BC)","v":109},{"$f":"SUMIF(Data!$R:$R,$O22,Data!BF:BF)","v":368},{"$f":"SUMIF(Data!$R:$R,$O22,Data!BI:BI)","v":823},{"$f":"SUMIF(Data!$R:$R,$O22,Data!BL:BL)","v":1719},{"$f":"SUMIF(Data!$R:$R,$O22,Data!BO:BO)","v":1657},{"$f":"SUMIF(Data!$R:$R,$O22,Data!BR:BR)","v":2006},{"$f":"SUMIF(Data!$R:$R,$O22,Data!BU:BU)","v":2516},{"$f":"SUMIF(Data!$R:$R,$O22,Data!BX:BX)","v":655},{"$f":"SUMIF(Data!$R:$R,$O22,Data!CA:CA)","v":9853},{"$f":"SUMIF(Data!$R:$R,$O22,Data!BD:BD)","v":117},{"$f":"SUMIF(Data!$R:$R,$O22,Data!BG:BG)","v":305},{"$f":"SUMIF(Data!$R:$R,$O22,Data!BJ:BJ)","v":756},{"$f":"SUMIF(Data!$R:$R,$O22,Data!BM:BM)","v":1755},{"$f":"SUMIF(Data!$R:$R,$O22,Data!BP:BP)","v":1677},{"$f":"SUMIF(Data!$R:$R,$O22,Data!BS:BS)","v":2602},{"$f":"SUMIF(Data!$R:$R,$O22,Data!BV:BV)","v":3084},{"$f":"SUMIF(Data!$R:$R,$O22,Data!BY:BY)","v":799},{"$f":"SUMIF(Data!$R:$R,$O22,Data!CB:CB)","v":11095}]
[null,"Tsawlaw",{"$f":"COUNTIF(Data!R:R,B23)","v":0},{"$f":"SUMIF(Data!R:R,'Analysis Tables'!B23,Data!DG:DG)","v":0},{"$f":"SUMIF(Data!R:R,'Analysis Tables'!B23,Data!DH:DH)","v":0},null,null,"Hsipaw",{"$f":"COUNTIF(Data!R:R,H23)","v":0},{"$f":"SUMIF(Data!R:R,'Analysis Tables'!H23,Data!DG:DG)","v":0},{"$f":"SUMIF(Data!R:R,'Analysis Tables'!H23,Data!DH:DH)","v":0},null,null,null,"Tsawlaw",{"$f":"SUMIF(Data!$R:$R,$O23,Data!BC:BC)","v":0},{"$f":"SUMIF(Data!$R:$R,$O23,Data!BF:BF)","v":0},{"$f":"SUMIF(Data!$R:$R,$O23,Data!BI:BI)","v":0},{"$f":"SUMIF(Data!$R:$R,$O23,Data!BL:BL)","v":0},{"$f":"SUMIF(Data!$R:$R,$O23,Data!BO:BO)","v":0},{"$f":"SUMIF(Data!$R:$R,$O23,Data!BR:BR)","v":0},{"$f":"SUMIF(Data!$R:$R,$O23,Data!BU:BU)","v":0},{"$f":"SUMIF(Data!$R:$R,$O23,Data!BX:BX)","v":0},{"$f":"SUMIF(Data!$R:$R,$O23,Data!CA:CA)","v":0},{"$f":"SUMIF(Data!$R:$R,$O23,Data!BD:BD)","v":0},{"$f":"SUMIF(Data!$R:$R,$O23,Data!BG:BG)","v":0},{"$f":"SUMIF(Data!$R:$R,$O23,Data!BJ:BJ)","v":0},{"$f":"SUMIF(Data!$R:$R,$O23,Data!BM:BM)","v":0},{"$f":"SUMIF(Data!$R:$R,$O23,Data!BP:BP)","v":0},{"$f":"SUMIF(Data!$R:$R,$O23,Data!BS:BS)","v":0},{"$f":"SUMIF(Data!$R:$R,$O23,Data!BV:BV)","v":0},{"$f":"SUMIF(Data!$R:$R,$O23,Data!BY:BY)","v":0},{"$f":"SUMIF(Data!$R:$R,$O23,Data!CB:CB)","v":0}]
[null,"Machanbaw",{"$f":"COUNTIF(Data!R:R,B24)","v":0},{"$f":"SUMIF(Data!R:R,'Analysis Tables'!B24,Data!DG:DG)","v":0},{"$f":"SUMIF(Data!R:R,'Analysis Tables'!B24,Data!DH:DH)","v":0},null,null,"Pangsang",{"$f":"COUNTIF(Data!R:R,H24)","v":0},{"$f":"SUMIF(Data!R:R,'Analysis Tables'!H24,Data!DG:DG)","v":0},{"$f":"SUMIF(Data!R:R,'Analysis Tables'!H24,Data!DH:DH)","v":0},null,null,null,"Machanbaw",{"$f":"SUMIF(Data!$R:$R,$O24,Data!BC:BC)","v":0},{"$f":"SUMIF(Data!$R:$R,$O24,Data!BF:BF)","v":0},{"$f":"SUMIF(Data!$R:$R,$O24,Data!BI:BI)","v":0},{"$f":"SUMIF(Data!$R:$R,$O24,Data!BL:BL)","v":0},{"$f":"SUMIF(Data!$R:$R,$O24,Data!BO:BO)","v":0},{"$f":"SUMIF(Data!$R:$R,$O24,Data!BR:BR)","v":0},{"$f":"SUMIF(Data!$R:$R,$O24,Data!BU:BU)","v":0},{"$f":"SUMIF(Data!$R:$R,$O24,Data!BX:BX)","v":0},{"$f":"SUMIF(Data!$R:$R,$O24,Data!CA:CA)","v":0},{"$f":"SUMIF(Data!$R:$R,$O24,Data!BD:BD)","v":0},{"$f":"SUMIF(Data!$R:$R,$O24,Data!BG:BG)","v":0},{"$f":"SUMIF(Data!$R:$R,$O24,Data!BJ:BJ)","v":0},{"$f":"SUMIF(Data!$R:$R,$O24,Data!BM:BM)","v":0},{"$f":"SUMIF(Data!$R:$R,$O24,Data!BP:BP)","v":0},{"$f":"SUMIF(Data!$R:$R,$O24,Data!BS:BS)","v":0},{"$f":"SUMIF(Data!$R:$R,$O24,Data!BV:BV)","v":0},{"$f":"SUMIF(Data!$R:$R,$O24,Data!BY:BY)","v":0},{"$f":"SUMIF(Data!$R:$R,$O24,Data!CB:CB)","v":0}]
[null,"Hpakant",{"$f":"COUNTIF(Data!R:R,B25)","v":22},{"$f":"SUMIF(Data!R:R,'Analysis Tables'!B25,Data!DG:DG)","v":796},{"$f":"SUMIF(Data!R:R,'Analysis Tables'!B25,Data!DH:DH)","v":3189},null,null,"Pangwaun",{"$f":"COUNTIF(Data!R:R,H25)","v":0},{"$f":"SUMIF(Data!R:R,'Analysis Tables'!H25,Data!DG:DG)","v":0},{"$f":"SUMIF(Data!R:R,'Analysis Tables'!H25,Data!DH:DH)","v":0},null,null,null,"Hpakant",{"$f":"SUMIF(Data!$R:$R,$O25,Data!BC:BC)","v":32},{"$f":"SUMIF(Data!$R:$R,$O25,Data!BF:BF)","v":68},{"$f":"SUMIF(Data!$R:$R,$O25,Data!BI:BI)","v":115},{"$f":"SUMIF(Data!$R:$R,$O25,Data!BL:BL)","v":387},{"$f":"SUMIF(Data!$R:$R,$O25,Data!BO:BO)","v":328},{"$f":"SUMIF(Data!$R:$R,$O25,Data!BR:BR)","v":353},{"$f":"SUMIF(Data!$R:$R,$O25,Data!BU:BU)","v":410},{"$f":"SUMIF(Data!$R:$R,$O25,Data!BX:BX)","v":69},{"$f":"SUMIF(Data!$R:$R,$O25,Data!CA:CA)","v":1762},{"$f":"SUMIF(Data!$R:$R,$O25,Data!BD:BD)","v":32},{"$f":"SUMIF(Data!$R:$R,$O25,Data!BG:BG)","v":76},{"$f":"SUMIF(Data!$R:$R,$O25,Data!BJ:BJ)","v":141},{"$f":"SUMIF(Data!$R:$R,$O25,Data!BM:BM)","v":374},{"$f":"SUMIF(Data!$R:$R,$O25,Data!BP:BP)","v":312},{"$f":"SUMIF(Data!$R:$R,$O25,Data!BS:BS)","v":425},{"$f":"SUMIF(Data!$R:$R,$O25,Data!BV:BV)","v":480},{"$f":"SUMIF(Data!$R:$R,$O25,Data!BY:BY)","v":97},{"$f":"SUMIF(Data!$R:$R,$O25,Data!CB:CB)","v":1937}]
[null,"TOTALS",{"$f":"SUM(C8:C25)","v":110},{"$f":"SUM(D8:D25)","v":13944},{"$f":"SUM(E8:E25)","v":64047},null,null,"Hopang",{"$f":"COUNTIF(Data!R:R,H26)","v":0},{"$f":"SUMIF(Data!R:R,'Analysis Tables'!H26,Data!DG:DG)","v":0},{"$f":"SUMIF(Data!R:R,'Analysis Tables'!H26,Data!DH:DH)","v":0},null,null,null,"TOTALS",{"$f":"SUM(P8:P25)","v":514},{"$f":"SUM(Q8:Q25)","v":1271},2679,6747,5583,6442,6270,1810,31316,549,1197,2701,6367,5695,7957,7902,2462,34830]
[null,null,null,null,null,null,null,"Manton",{"$f":"COUNTIF(Data!R:R,H27)","v":1},{"$f":"SUMIF(Data!R:R,'Analysis Tables'!H27,Data!DG:DG)","v":43},{"$f":"SUMIF(Data!R:R,'Analysis Tables'!H27,Data!DH:DH)","v":183},null,null,"Shan (North)","Namphan",{"$f":"SUMIF(Data!$R:$R,$O27,Data!BC:BC)","v":0},{"$f":"SUMIF(Data!$R:$R,$O27,Data!BF:BF)","v":0},{"$f":"SUMIF(Data!$R:$R,$O27,Data!BI:BI)","v":0},{"$f":"SUMIF(Data!$R:$R,$O27,Data!BL:BL)","v":0},{"$f":"SUMIF(Data!$R:$R,$O27,Data!BO:BO)","v":0},{"$f":"SUMIF(Data!$R:$R,$O27,Data!BR:BR)","v":0},{"$f":"SUMIF(Data!$R:$R,$O27,Data!BU:BU)","v":0},{"$f":"SUMIF(Data!$R:$R,$O27,Data!BX:BX)","v":0},{"$f":"SUMIF(Data!$R:$R,$O27,Data!CA:CA)","v":0},{"$f":"SUMIF(Data!$R:$R,$O27,Data!BD:BD)","v":0},{"$f":"SUMIF(Data!$R:$R,$O27,Data!BG:BG)","v":0},{"$f":"SUMIF(Data!$R:$R,$O27,Data!BJ:BJ)","v":0},{"$f":"SUMIF(Data!$R:$R,$O27,Data!BM:BM)","v":0},{"$f":"SUMIF(Data!$R:$R,$O27,Data!BP:BP)","v":0},{"$f":"SUMIF(Data!$R:$R,$O27,Data!BS:BS)","v":0},{"$f":"SUMIF(Data!$R:$R,$O27,Data!BV:BV)","v":0},{"$f":"SUMIF(Data!$R:$R,$O27,Data!BY:BY)","v":0},{"$f":"SUMIF(Data!$R:$R,$O27,Data!CB:CB)","v":0}]
[null,null,null,null,null,null,null,"Konkyan",{"$f":"COUNTIF(Data!R:R,H28)","v":0},{"$f":"SUMIF(Data!R:R,'Analysis Tables'!H28,Data!DG:DG)","v":0},{"$f":"SUMIF(Data!R:R,'Analysis Tables'!H28,Data!DH:DH)","v":0},null,null,null,"Nawnghkio",{"$f":"SUMIF(Data!$R:$R,$O28,Data!BC:BC)","v":0},{"$f":"SUMIF(Data!$R:$R,$O28,Data!BF:BF)","v":0},{"$f":"SUMIF(Data!$R:$R,$O28,Data!BI:BI)","v":0},{"$f":"SUMIF(Data!$R:$R,$O28,Data!BL:BL)","v":0},{"$f":"SUMIF(Data!$R:$R,$O28,Data!BO:BO)","v":0},{"$f":"SUMIF(Data!$R:$R,$O28,Data!BR:BR)","v":0},{"$f":"SUMIF(Data!$R:$R,$O28,Data!BU:BU)","v":0},{"$f":"SUMIF(Data!$R:$R,$O28,Data!BX:BX)","v":0},{"$f":"SUMIF(Data!$R:$R,$O28,Data!CA:CA)","v":0},{"$f":"SUMIF(Data!$R:$R,$O28,Data!BD:BD)","v":0},{"$f":"SUMIF(Data!$R:$R,$O28,Data!BG:BG)","v":0},{"$f":"SUMIF(Data!$R:$R,$O28,Data!BJ:BJ)","v":0},{"$f":"SUMIF(Data!$R:$R,$O28,Data!BM:BM)","v":0},{"$f":"SUMIF(Data!$R:$R,$O28,Data!BP:BP)","v":0},{"$f":"SUMIF(Data!$R:$R,$O28,Data!BS:BS)","v":0},{"$f":"SUMIF(Data!$R:$R,$O28,Data!BV:BV)","v":0},{"$f":"SUMIF(Data!$R:$R,$O28,Data!BY:BY)","v":0},{"$f":"SUMIF(Data!$R:$R,$O28,Data!CB:CB)","v":0}]
[null,"OVERALL CAMP POPULATIONS",null,null,null,null,null,"Tangyan",{"$f":"COUNTIF(Data!R:R,H29)","v":0},{"$f":"SUMIF(Data!R:R,'Analysis Tables'!H29,Data!DG:DG)","v":0},{"$f":"SUMIF(Data!R:R,'Analysis Tables'!H29,Data!DH:DH)","v":0},null,null,null,"Mongyai",{"$f":"SUMIF(Data!$R:$R,$O29,Data!BC:BC)","v":0},{"$f":"SUMIF(Data!$R:$R,$O29,Data!BF:BF)","v":0},{"$f":"SUMIF(Data!$R:$R,$O29,Data!BI:BI)","v":0},{"$f":"SUMIF(Data!$R:$R,$O29,Data!BL:BL)","v":0},{"$f":"SUMIF(Data!$R:$R,$O29,Data!BO:BO)","v":0},{"$f":"SUMIF(Data!$R:$R,$O29,Data!BR:BR)","v":0},{"$f":"SUMIF(Data!$R:$R,$O29,Data!BU:BU)","v":0},{"$f":"SUMIF(Data!$R:$R,$O29,Data!BX:BX)","v":0},{"$f":"SUMIF(Data!$R:$R,$O29,Data!CA:CA)","v":0},{"$f":"SUMIF(Data!$R:$R,$O29,Data!BD:BD)","v":0},{"$f":"SUMIF(Data!$R:$R,$O29,Data!BG:BG)","v":0},{"$f":"SUMIF(Data!$R:$R,$O29,Data!BJ:BJ)","v":0},{"$f":"SUMIF(Data!$R:$R,$O29,Data!BM:BM)","v":0},{"$f":"SUMIF(Data!$R:$R,$O29,Data!BP:BP)","v":0},{"$f":"SUMIF(Data!$R:$R,$O29,Data!BS:BS)","v":0},{"$f":"SUMIF(Data!$R:$R,$O29,Data!BV:BV)","v":0},{"$f":"SUMIF(Data!$R:$R,$O29,Data!BY:BY)","v":0},{"$f":"SUMIF(Data!$R:$R,$O29,Data!CB:CB)","v":0}]
[null,"Kachin",{"$f":"COUNTIF(Data!Q:Q,B30)","v":110},{"$f":"SUMIF(Data!Q:Q,'Analysis Tables'!B30,Data!DG:DG)","v":13944},{"$f":"SUMIF(Data!Q:Q,'Analysis Tables'!B30,Data!DH:DH)","v":64047},null,null,"Namhkan",{"$f":"COUNTIF(Data!R:R,H30)","v":4},{"$f":"SUMIF(Data!R:R,'Analysis Tables'!H30,Data!DG:DG)","v":239},{"$f":"SUMIF(Data!R:R,'Analysis Tables'!H30,Data!DH:DH)","v":1018},null,null,null,"Namhsan",{"$f":"SUMIF(Data!$R:$R,$O30,Data!BC:BC)","v":0},{"$f":"SUMIF(Data!$R:$R,$O30,Data!BF:BF)","v":0},{"$f":"SUMIF(Data!$R:$R,$O30,Data!BI:BI)","v":0},{"$f":"SUMIF(Data!$R:$R,$O30,Data!BL:BL)","v":0},{"$f":"SUMIF(Data!$R:$R,$O30,Data!BO:BO)","v":0},{"$f":"SUMIF(Data!$R:$R,$O30,Data!BR:BR)","v":0},{"$f":"SUMIF(Data!$R:$R,$O30,Data!BU:BU)","v":0},{"$f":"SUMIF(Data!$R:$R,$O30,Data!BX:BX)","v":0},{"$f":"SUMIF(Data!$R:$R,$O30,Data!CA:CA)","v":0},{"$f":"SUMIF(Data!$R:$R,$O30,Data!BD:BD)","v":0},{"$f":"SUMIF(Data!$R:$R,$O30,Data!BG:BG)","v":0},{"$f":"SUMIF(Data!$R:$R,$O30,Data!BJ:BJ)","v":0},{"$f":"SUMIF(Data!$R:$R,$O30,Data!BM:BM)","v":0},{"$f":"SUMIF(Data!$R:$R,$O30,Data!BP:BP)","v":0},{"$f":"SUMIF(Data!$R:$R,$O30,Data!BS:BS)","v":0},{"$f":"SUMIF(Data!$R:$R,$O30,Data!BV:BV)","v":0},{"$f":"SUMIF(Data!$R:$R,$O30,Data!BY:BY)","v":0},{"$f":"SUMIF(Data!$R:$R,$O30,Data!CB:CB)","v":0}]
[null,"Shan (North)",{"$f":"COUNTIF(Data!Q:Q,B31)","v":16},{"$f":"SUMIF(Data!Q:Q,'Analysis Tables'!B31,Data!DG:DG)","v":866},{"$f":"SUMIF(Data!Q:Q,'Analysis Tables'!B31,Data!DH:DH)","v":4005},null,null,"Mongmao",{"$f":"COUNTIF(Data!R:R,H31)","v":0},{"$f":"SUMIF(Data!R:R,'Analysis Tables'!H31,Data!DG:DG)","v":0},{"$f":"SUMIF(Data!R:R,'Analysis Tables'!H31,Data!DH:DH)","v":0},null,null,null,"Hseni",{"$f":"SUMIF(Data!$R:$R,$O31,Data!BC:BC)","v":1},{"$f":"SUMIF(Data!$R:$R,$O31,Data!BF:BF)","v":6},{"$f":"SUMIF(Data!$R:$R,$O31,Data!BI:BI)","v":12},{"$f":"SUMIF(Data!$R:$R,$O31,Data!BL:BL)","v":18},{"$f":"SUMIF(Data!$R:$R,$O31,Data!BO:BO)","v":23},{"$f":"SUMIF(Data!$R:$R,$O31,Data!BR:BR)","v":24},{"$f":"SUMIF(Data!$R:$R,$O31,Data!BU:BU)","v":34},{"$f":"SUMIF(Data!$R:$R,$O31,Data!BX:BX)","v":10},{"$f":"SUMIF(Data!$R:$R,$O31,Data!CA:CA)","v":128},{"$f":"SUMIF(Data!$R:$R,$O31,Data!BD:BD)","v":0},{"$f":"SUMIF(Data!$R:$R,$O31,Data!BG:BG)","v":3},{"$f":"SUMIF(Data!$R:$R,$O31,Data!BJ:BJ)","v":20},{"$f":"SUMIF(Data!$R:$R,$O31,Data!BM:BM)","v":17},{"$f":"SUMIF(Data!$R:$R,$O31,Data!BP:BP)","v":18},{"$f":"SUMIF(Data!$R:$R,$O31,Data!BS:BS)","v":24},{"$f":"SUMIF(Data!$R:$R,$O31,Data!BV:BV)","v":30},{"$f":"SUMIF(Data!$R:$R,$O31,Data!BY:BY)","v":18},{"$f":"SUMIF(Data!$R:$R,$O31,Data!CB:CB)","v":130}]
[null,"TOTALS",{"$f":"SUM(C30:C31)","v":126},{"$f":"SUM(D30:D31)","v":14810},{"$f":"SUM(E30:E31)","v":68052},null,null,"TOTALS",{"$f":"SUM(I8:I31)","v":16},{"$f":"SUM(J8:J31)","v":866},{"$f":"SUM(K8:K31)","v":4005},null,null,null,"Laukkaing",{"$f":"SUMIF(Data!$R:$R,$O32,Data!BC:BC)","v":0},{"$f":"SUMIF(Data!$R:$R,$O32,Data!BF:BF)","v":0},{"$f":"SUMIF(Data!$R:$R,$O32,Data!BI:BI)","v":0},{"$f":"SUMIF(Data!$R:$R,$O32,Data!BL:BL)","v":0},{"$f":"SUMIF(Data!$R:$R,$O32,Data!BO:BO)","v":0},{"$f":"SUMIF(Data!$R:$R,$O32,Data!BR:BR)","v":0},{"$f":"SUMIF(Data!$R:$R,$O32,Data!BU:BU)","v":0},{"$f":"SUMIF(Data!$R:$R,$O32,Data!BX:BX)","v":0},{"$f":"SUMIF(Data!$R:$R,$O32,Data!CA:CA)","v":0},{"$f":"SUMIF(Data!$R:$R,$O32,Data!BD:BD)","v":0},{"$f":"SUMIF(Data!$R:$R,$O32,Data!BG:BG)","v":0},{"$f":"SUMIF(Data!$R:$R,$O32,Data!BJ:BJ)","v":0},{"$f":"SUMIF(Data!$R:$R,$O32,Data!BM:BM)","v":0},{"$f":"SUMIF(Data!$R:$R,$O32,Data!BP:BP)","v":0},{"$f":"SUMIF(Data!$R:$R,$O32,Data!BS:BS)","v":0},{"$f":"SUMIF(Data!$R:$R,$O32,Data!BV:BV)","v":0},{"$f":"SUMIF(Data!$R:$R,$O32,Data!BY:BY)","v":0},{"$f":"SUMIF(Data!$R:$R,$O32,Data!CB:CB)","v":0}]
[null,null,null,null,null,null,null,null,null,null,null,null,null,null,"Muse",{"$f":"SUMIF(Data!$R:$R,$O33,Data!BC:BC)","v":6},{"$f":"SUMIF(Data!$R:$R,$O33,Data!BF:BF)","v":1},{"$f":"SUMIF(Data!$R:$R,$O33,Data!BI:BI)","v":6},{"$f":"SUMIF(Data!$R:$R,$O33,Data!BL:BL)","v":10},{"$f":"SUMIF(Data!$R:$R,$O33,Data!BO:BO)","v":4},{"$f":"SUMIF(Data!$R:$R,$O33,Data!BR:BR)","v":4},{"$f":"SUMIF(Data!$R:$R,$O33,Data!BU:BU)","v":6},{"$f":"SUMIF(Data!$R:$R,$O33,Data!BX:BX)","v":2},{"$f":"SUMIF(Data!$R:$R,$O33,Data!CA:CA)","v":39},{"$f":"SUMIF(Data!$R:$R,$O33,Data!BD:BD)","v":0},{"$f":"SUMIF(Data!$R:$R,$O33,Data!BG:BG)","v":4},{"$f":"SUMIF(Data!$R:$R,$O33,Data!BJ:BJ)","v":6},{"$f":"SUMIF(Data!$R:$R,$O33,Data!BM:BM)","v":17},{"$f":"SUMIF(Data!$R:$R,$O33,Data!BP:BP)","v":5},{"$f":"SUMIF(Data!$R:$R,$O33,Data!BS:BS)","v":10},{"$f":"SUMIF(Data!$R:$R,$O33,Data!BV:BV)","v":15},{"$f":"SUMIF(Data!$R:$R,$O33,Data!BY:BY)","v":3},{"$f":"SUMIF(Data!$R:$R,$O33,Data!CB:CB)","v":60}]
[null,null,null,null,null,null,null,null,null,null,null,null,null,null,"Mabein",{"$f":"SUMIF(Data!$R:$R,$O34,Data!BC:BC)","v":0},{"$f":"SUMIF(Data!$R:$R,$O34,Data!BF:BF)","v":0},{"$f":"SUMIF(Data!$R:$R,$O34,Data!BI:BI)","v":0},{"$f":"SUMIF(Data!$R:$R,$O34,Data!BL:BL)","v":0},{"$f":"SUMIF(Data!$R:$R,$O34,Data!BO:BO)","v":0},{"$f":"SUMIF(Data!$R:$R,$O34,Data!BR:BR)","v":0},{"$f":"SUMIF(Data!$R:$R,$O34,Data!BU:BU)","v":0},{"$f":"SUMIF(Data!$R:$R,$O34,Data!BX:BX)","v":0},{"$f":"SUMIF(Data!$R:$R,$O34,Data!CA:CA)","v":0},{"$f":"SUMIF(Data!$R:$R,$O34,Data!BD:BD)","v":0},{"$f":"SUMIF(Data!$R:$R,$O34,Data!BG:BG)","v":0},{"$f":"SUMIF(Data!$R:$R,$O34,Data!BJ:BJ)","v":0},{"$f":"SUMIF(Data!$R:$R,$O34,Data!BM:BM)","v":0},{"$f":"SUMIF(Data!$R:$R,$O34,Data!BP:BP)","v":0},{"$f":"SUMIF(Data!$R:$R,$O34,Data!BS:BS)","v":0},{"$f":"SUMIF(Data!$R:$R,$O34,Data!BV:BV)","v":0},{"$f":"SUMIF(Data!$R:$R,$O34,Data!BY:BY)","v":0},{"$f":"SUMIF(Data!$R:$R,$O34,Data!CB:CB)","v":0}]
[null,"CAMP MANAGEMENT AGENCY",null,null,null,null,null,"CAMP MANAGEMENT COMMITTEE",null,null,null,null,null,null,"Kyaukme",{"$f":"SUMIF(Data!$R:$R,$O35,Data!BC:BC)","v":0},{"$f":"SUMIF(Data!$R:$R,$O35,Data!BF:BF)","v":0},{"$f":"SUMIF(Data!$R:$R,$O35,Data!BI:BI)","v":0},{"$f":"SUMIF(Data!$R:$R,$O35,Data!BL:BL)","v":0},{"$f":"SUMIF(Data!$R:$R,$O35,Data!BO:BO)","v":0},{"$f":"SUMIF(Data!$R:$R,$O35,Data!BR:BR)","v":0},{"$f":"SUMIF(Data!$R:$R,$O35,Data!BU:BU)","v":0},{"$f":"SUMIF(Data!$R:$R,$O35,Data!BX:BX)","v":0},{"$f":"SUMIF(Data!$R:$R,$O35,Data!CA:CA)","v":0},{"$f":"SUMIF(Data!$R:$R,$O35,Data!BD:BD)","v":0},{"$f":"SUMIF(Data!$R:$R,$O35,Data!BG:BG)","v":0},{"$f":"SUMIF(Data!$R:$R,$O35,Data!BJ:BJ)","v":0},{"$f":"SUMIF(Data!$R:$R,$O35,Data!BM:BM)","v":0},{"$f":"SUMIF(Data!$R:$R,$O35,Data!BP:BP)","v":0},{"$f":"SUMIF(Data!$R:$R,$O35,Data!BS:BS)","v":0},{"$f":"SUMIF(Data!$R:$R,$O35,Data!BV:BV)","v":0},{"$f":"SUMIF(Data!$R:$R,$O35,Data!BY:BY)","v":0},{"$f":"SUMIF(Data!$R:$R,$O35,Data!CB:CB)","v":0}]
[null,"State","Total Number of Camps","Yes","No",null,null,"State","Total Number of Camps","Yes","No",null,null,null,"Lashio",{"$f":"SUMIF(Data!$R:$R,$O36,Data!BC:BC)","v":0},{"$f":"SUMIF(Data!$R:$R,$O36,Data!BF:BF)","v":0},{"$f":"SUMIF(Data!$R:$R,$O36,Data!BI:BI)","v":0},{"$f":"SUMIF(Data!$R:$R,$O36,Data!BL:BL)","v":0},{"$f":"SUMIF(Data!$R:$R,$O36,Data!BO:BO)","v":0},{"$f":"SUMIF(Data!$R:$R,$O36,Data!BR:BR)","v":0},{"$f":"SUMIF(Data!$R:$R,$O36,Data!BU:BU)","v":0},{"$f":"SUMIF(Data!$R:$R,$O36,Data!BX:BX)","v":0},{"$f":"SUMIF(Data!$R:$R,$O36,Data!CA:CA)","v":0},{"$f":"SUMIF(Data!$R:$R,$O36,Data!BD:BD)","v":0},{"$f":"SUMIF(Data!$R:$R,$O36,Data!BG:BG)","v":0},{"$f":"SUMIF(Data!$R:$R,$O36,Data!BJ:BJ)","v":0},{"$f":"SUMIF(Data!$R:$R,$O36,Data!BM:BM)","v":0},{"$f":"SUMIF(Data!$R:$R,$O36,Data!BP:BP)","v":0},{"$f":"SUMIF(Data!$R:$R,$O36,Data!BS:BS)","v":0},{"$f":"SUMIF(Data!$R:$R,$O36,Data!BV:BV)","v":0},{"$f":"SUMIF(Data!$R:$R,$O36,Data!BY:BY)","v":0},{"$f":"SUMIF(Data!$R:$R,$O36,Data!CB:CB)","v":0}]
[null,"Kachin",{"$f":"COUNTIF(Data!Q:Q,B30)","v":110},{"$f":"IFERROR(COUNTIFS(Data!Q:Q,$B37,Data!AM:AM,\"Yes\"),0)","v":106},{"$f":"IFERROR(COUNTIFS(Data!Q:Q,$B37,Data!AM:AM,\"No\"),0)","v":3},null,null,"Kachin",{"$f":"COUNTIF(Data!Q:Q,B30)","v":110},{"$f":"IFERROR(COUNTIFS(Data!Q:Q,$B37,Data!DN:DN,\"Yes\"),0)","v":104},{"$f":"IFERROR(COUNTIFS(Data!Q:Q,$B37,Data!DN:DN,\"No\"),0)","v":6},null,null,null,"Kunlong",{"$f":"SUMIF(Data!$R:$R,$O37,Data!BC:BC)","v":0},{"$f":"SUMIF(Data!$R:$R,$O37,Data!BF:BF)","v":0},{"$f":"SUMIF(Data!$R:$R,$O37,Data!BI:BI)","v":0},{"$f":"SUMIF(Data!$R:$R,$O37,Data!BL:BL)","v":0},{"$f":"SUMIF(Data!$R:$R,$O37,Data!BO:BO)","v":0},{"$f":"SUMIF(Data!$R:$R,$O37,Data!BR:BR)","v":0},{"$f":"SUMIF(Data!$R:$R,$O37,Data!BU:BU)","v":0},{"$f":"SUMIF(Data!$R:$R,$O37,Data!BX:BX)","v":0},{"$f":"SUMIF(Data!$R:$R,$O37,Data!CA:CA)","v":0},{"$f":"SUMIF(Data!$R:$R,$O37,Data!BD:BD)","v":0},{"$f":"SUMIF(Data!$R:$R,$O37,Data!BG:BG)","v":0},{"$f":"SUMIF(Data!$R:$R,$O37,Data!BJ:BJ)","v":0},{"$f":"SUMIF(Data!$R:$R,$O37,Data!BM:BM)","v":0},{"$f":"SUMIF(Data!$R:$R,$O37,Data!BP:BP)","v":0},{"$f":"SUMIF(Data!$R:$R,$O37,Data!BS:BS)","v":0},{"$f":"SUMIF(Data!$R:$R,$O37,Data!BV:BV)","v":0},{"$f":"SUMIF(Data!$R:$R,$O37,Data!BY:BY)","v":0},{"$f":"SUMIF(Data!$R:$R,$O37,Data!CB:CB)","v":0}]
[null,"Shan (North)",{"$f":"COUNTIF(Data!Q:Q,B31)","v":16},{"$f":"IFERROR(COUNTIFS(Data!Q:Q,$B38,Data!AM:AM,\"Yes\"),0)","v":16},{"$f":"IFERROR(COUNTIFS(Data!Q:Q,$B38,Data!AM:AM,\"No\"),0)","v":0},null,null,"Shan (North)",{"$f":"COUNTIF(Data!Q:Q,B31)","v":16},{"$f":"IFERROR(COUNTIFS(Data!Q:Q,$B38,Data!DN:DN,\"Yes\"),0)","v":14},{"$f":"IFERROR(COUNTIFS(Data!Q:Q,$B38,Data!DN:DN,\"No\"),0)","v":0},null,null,null,"Matman",{"$f":"SUMIF(Data!$R:$R,$O38,Data!BC:BC)","v":0},{"$f":"SUMIF(Data!$R:$R,$O38,Data!BF:BF)","v":0},{"$f":"SUMIF(Data!$R:$R,$O38,Data!BI:BI)","v":0},{"$f":"SUMIF(Data!$R:$R,$O38,Data!BL:BL)","v":0},{"$f":"SUMIF(Data!$R:$R,$O38,Data!BO:BO)","v":0},{"$f":"SUMIF(Data!$R:$R,$O38,Data!BR:BR)","v":0},{"$f":"SUMIF(Data!$R:$R,$O38,Data!BU:BU)","v":0},{"$f":"SUMIF(Data!$R:$R,$O38,Data!BX:BX)","v":0},{"$f":"SUMIF(Data!$R:$R,$O38,Data!CA:CA)","v":0},{"$f":"SUMIF(Data!$R:$R,$O38,Data!BD:BD)","v":0},{"$f":"SUMIF(Data!$R:$R,$O38,Data!BG:BG)","v":0},{"$f":"SUMIF(Data!$R:$R,$O38,Data!BJ:BJ)","v":0},{"$f":"SUMIF(Data!$R:$R,$O38,Data!BM:BM)","v":0},{"$f":"SUMIF(Data!$R:$R,$O38,Data!BP:BP)","v":0},{"$f":"SUMIF(Data!$R:$R,$O38,Data!BS:BS)","v":0},{"$f":"SUMIF(Data!$R:$R,$O38,Data!BV:BV)","v":0},{"$f":"SUMIF(Data!$R:$R,$O38,Data!BY:BY)","v":0},{"$f":"SUMIF(Data!$R:$R,$O38,Data!CB:CB)","v":0}]
[null,"TOTALS",{"$f":"SUM(C37:C38)","v":126},{"$f":"SUM(D37:D38)/$C$39","v":0.96825396825396826},{"$f":"SUM(E37:E38)/$C$39","v":2.3809523809523808E-2},null,null,"TOTALS",{"$f":"SUM(I37:I38)","v":126},{"$f":"SUM(J37:J38)/$C$39","v":0.93650793650793651},{"$f":"SUM(K37:K38)/$C$39","v":4.7619047619047616E-2},null,null,null,"Namtu",{"$f":"SUMIF(Data!$R:$R,$O39,Data!BC:BC)","v":0},{"$f":"SUMIF(Data!$R:$R,$O39,Data!BF:BF)","v":4},{"$f":"SUMIF(Data!$R:$R,$O39,Data!BI:BI)","v":6},{"$f":"SUMIF(Data!$R:$R,$O39,Data!BL:BL)","v":9},{"$f":"SUMIF(Data!$R:$R,$O39,Data!BO:BO)","v":1},{"$f":"SUMIF(Data!$R:$R,$O39,Data!BR:BR)","v":2},{"$f":"SUMIF(Data!$R:$R,$O39,Data!BU:BU)","v":3},{"$f":"SUMIF(Data!$R:$R,$O39,Data!BX:BX)","v":1},{"$f":"SUMIF(Data!$R:$R,$O39,Data!CA:CA)","v":26},{"$f":"SUMIF(Data!$R:$R,$O39,Data!BD:BD)","v":0},{"$f":"SUMIF(Data!$R:$R,$O39,Data!BG:BG)","v":1},{"$f":"SUMIF(Data!$R:$R,$O39,Data!BJ:BJ)","v":7},{"$f":"SUMIF(Data!$R:$R,$O39,Data!BM:BM)","v":11},{"$f":"SUMIF(Data!$R:$R,$O39,Data!BP:BP)","v":6},{"$f":"SUMIF(Data!$R:$R,$O39,Data!BS:BS)","v":8},{"$f":"SUMIF(Data!$R:$R,$O39,Data!BV:BV)","v":6},{"$f":"SUMIF(Data!$R:$R,$O39,Data!BY:BY)","v":1},{"$f":"SUMIF(Data!$R:$R,$O39,Data!CB:CB)","v":40}]
[null,null,null,null,null,null,null,null,null,null,null,null,null,null,"Mongmit",{"$f":"SUMIF(Data!$R:$R,$O40,Data!BC:BC)","v":0},{"$f":"SUMIF(Data!$R:$R,$O40,Data!BF:BF)","v":0},{"$f":"SUMIF(Data!$R:$R,$O40,Data!BI:BI)","v":0},{"$f":"SUMIF(Data!$R:$R,$O40,Data!BL:BL)","v":0},{"$f":"SUMIF(Data!$R:$R,$O40,Data!BO:BO)","v":0},{"$f":"SUMIF(Data!$R:$R,$O40,Data!BR:BR)","v":0},{"$f":"SUMIF(Data!$R:$R,$O40,Data!BU:BU)","v":0},{"$f":"SUMIF(Data!$R:$R,$O40,Data!BX:BX)","v":0},{"$f":"SUMIF(Data!$R:$R,$O40,Data!CA:CA)","v":0},{"$f":"SUMIF(Data!$R:$R,$O40,Data!BD:BD)","v":0},{"$f":"SUMIF(Data!$R:$R,$O40,Data!BG:BG)","v":0},{"$f":"SUMIF(Data!$R:$R,$O40,Data!BJ:BJ)","v":0},{"$f":"SUMIF(Data!$R:$R,$O40,Data!BM:BM)","v":0},{"$f":"SUMIF(Data!$R:$R,$O40,Data!BP:BP)","v":0},{"$f":"SUMIF(Data!$R:$R,$O40,Data!BS:BS)","v":0},{"$f":"SUMIF(Data!$R:$R,$O40,Data!BV:BV)","v":0},{"$f":"SUMIF(Data!$R:$R,$O40,Data!BY:BY)","v":0},{"$f":"SUMIF(Data!$R:$R,$O40,Data!CB:CB)","v":0}]
[null,"CAMP LOCATION TYPE - KACHIN",null,null,null,null,null,"CAMP LOCATION TYPE - SHAN (NORTH)",null,null,null,null,null,null,"Kutkai",{"$f":"SUMIF(Data!$R:$R,$O41,Data!BC:BC)","v":19},{"$f":"SUMIF(Data!$R:$R,$O41,Data!BF:BF)","v":60},{"$f":"SUMIF(Data!$R:$R,$O41,Data!BI:BI)","v":93},{"$f":"SUMIF(Data!$R:$R,$O41,Data!BL:BL)","v":265},{"$f":"SUMIF(Data!$R:$R,$O41,Data!BO:BO)","v":195},{"$f":"SUMIF(Data!$R:$R,$O41,Data!BR:BR)","v":218},{"$f":"SUMIF(Data!$R:$R,$O41,Data!BU:BU)","v":184},{"$f":"SUMIF(Data!$R:$R,$O41,Data!BX:BX)","v":56},{"$f":"SUMIF(Data!$R:$R,$O41,Data!CA:CA)","v":1090},{"$f":"SUMIF(Data!$R:$R,$O41,Data!BD:BD)","v":19},{"$f":"SUMIF(Data!$R:$R,$O41,Data!BG:BG)","v":81},{"$f":"SUMIF(Data!$R:$R,$O41,Data!BJ:BJ)","v":102},{"$f":"SUMIF(Data!$R:$R,$O41,Data!BM:BM)","v":281},{"$f":"SUMIF(Data!$R:$R,$O41,Data!BP:BP)","v":147},{"$f":"SUMIF(Data!$R:$R,$O41,Data!BS:BS)","v":285},{"$f":"SUMIF(Data!$R:$R,$O41,Data!BV:BV)","v":283},{"$f":"SUMIF(Data!$R:$R,$O41,Data!BY:BY)","v":74},{"$f":"SUMIF(Data!$R:$R,$O41,Data!CB:CB)","v":1272}]
[null,"Townships","Total Number of Camps","Urban","Rural","Forest/bush",null,"Townships","Total Number of Camps","Urban","Rural","Forest/bush",null,null,"Hsipaw",{"$f":"SUMIF(Data!$R:$R,$O42,Data!BC:BC)","v":0},{"$f":"SUMIF(Data!$R:$R,$O42,Data!BF:BF)","v":0},{"$f":"SUMIF(Data!$R:$R,$O42,Data!BI:BI)","v":0},{"$f":"SUMIF(Data!$R:$R,$O42,Data!BL:BL)","v":0},{"$f":"SUMIF(Data!$R:$R,$O42,Data!BO:BO)","v":0},{"$f":"SUMIF(Data!$R:$R,$O42,Data!BR:BR)","v":0},{"$f":"SUMIF(Data!$R:$R,$O42,Data!BU:BU)","v":0},{"$f":"SUMIF(Data!$R:$R,$O42,Data!BX:BX)","v":0},{"$f":"SUMIF(Data!$R:$R,$O42,Data!CA:CA)","v":0},{"$f":"SUMIF(Data!$R:$R,$O42,Data!BD:BD)","v":0},{"$f":"SUMIF(Data!$R:$R,$O42,Data!BG:BG)","v":0},{"$f":"SUMIF(Data!$R:$R,$O42,Data!BJ:BJ)","v":0},{"$f":"SUMIF(Data!$R:$R,$O42,Data!BM:BM)","v":0},{"$f":"SUMIF(Data!$R:$R,$O42,Data!BP:BP)","v":0},{"$f":"SUMIF(Data!$R:$R,$O42,Data!BS:BS)","v":0},{"$f":"SUMIF(Data!$R:$R,$O42,Data!BV:BV)","v":0},{"$f":"SUMIF(Data!$R:$R,$O42,Data!BY:BY)","v":0},{"$f":"SUMIF(Data!$R:$R,$O42,Data!CB:CB)","v":0}]
[null,"Momauk",{"$f":"COUNTIF(Data!R:R,B43)","v":14},{"$f":"COUNTIFS(Data!R:R,'Analysis Tables'!B43,Data!Y:Y,'Analysis Tables'!$D$42)","v":9},{"$f":"COUNTIFS(Data!R:R,'Analysis Tables'!B43,Data!Y:Y,'Analysis Tables'!$E$42)","v":4},{"$f":"COUNTIFS(Data!R:R,'Analysis Tables'!B43,Data!Y:Y,'Analysis Tables'!$F$42)","v":1},null,"Namphan",{"$f":"COUNTIF(Data!R:R,H43)","v":0},{"$f":"COUNTIFS(Data!R:R,'Analysis Tables'!H43,Data!Y:Y,'Analysis Tables'!$J$42)","v":0},{"$f":"COUNTIFS(Data!R:R,'Analysis Tables'!H43,Data!Y:Y,'Analysis Tables'!$K$42)","v":0},{"$f":"COUNTIFS(Data!R:R,'Analysis Tables'!H43,Data!Y:Y,'Analysis Tables'!$L$42)","v":0},null,null,"Pangsang",{"$f":"SUMIF(Data!$R:$R,$O43,Data!BC:BC)","v":0},{"$f":"SUMIF(Data!$R:$R,$O43,Data!BF:BF)","v":0},{"$f":"SUMIF(Data!$R:$R,$O43,Data!BI:BI)","v":0},{"$f":"SUMIF(Data!$R:$R,$O43,Data!BL:BL)","v":0},{"$f":"SUMIF(Data!$R:$R,$O43,Data!BO:BO)","v":0},{"$f":"SUMIF(Data!$R:$R,$O43,Data!BR:BR)","v":0},{"$f":"SUMIF(Data!$R:$R,$O43,Data!BU:BU)","v":0},{"$f":"SUMIF(Data!$R:$R,$O43,Data!BX:BX)","v":0},{"$f":"SUMIF(Data!$R:$R,$O43,Data!CA:CA)","v":0},{"$f":"SUMIF(Data!$R:$R,$O43,Data!BD:BD)","v":0},{"$f":"SUMIF(Data!$R:$R,$O43,Data!BG:BG)","v":0},{"$f":"SUMIF(Data!$R:$R,$O43,Data!BJ:BJ)","v":0},{"$f":"SUMIF(Data!$R:$R,$O43,Data!BM:BM)","v":0},{"$f":"SUMIF(Data!$R:$R,$O43,Data!BP:BP)","v":0},{"$f":"SUMIF(Data!$R:$R,$O43,Data!BS:BS)","v":0},{"$f":"SUMIF(Data!$R:$R,$O43,Data!BV:BV)","v":0},{"$f":"SUMIF(Data!$R:$R,$O43,Data!BY:BY)","v":0},{"$f":"SUMIF(Data!$R:$R,$O43,Data!CB:CB)","v":0}]
[null,"Mogaung",{"$f":"COUNTIF(Data!R:R,B44)","v":3},{"$f":"COUNTIFS(Data!R:R,'Analysis Tables'!B44,Data!Y:Y,'Analysis Tables'!$D$42)","v":3},{"$f":"COUNTIFS(Data!R:R,'Analysis Tables'!B44,Data!Y:Y,'Analysis Tables'!$E$42)","v":0},{"$f":"COUNTIFS(Data!R:R,'Analysis Tables'!B44,Data!Y:Y,'Analysis Tables'!$F$42)","v":0},null,"Nawnghkio",{"$f":"COUNTIF(Data!R:R,H44)","v":0},{"$f":"COUNTIFS(Data!R:R,'Analysis Tables'!H44,Data!Y:Y,'Analysis Tables'!$J$42)","v":0},{"$f":"COUNTIFS(Data!R:R,'Analysis Tables'!H44,Data!Y:Y,'Analysis Tables'!$K$42)","v":0},{"$f":"COUNTIFS(Data!R:R,'Analysis Tables'!H44,Data!Y:Y,'Analysis Tables'!$L$42)","v":0},null,null,"Pangwaun",{"$f":"SUMIF(Data!$R:$R,$O44,Data!BC:BC)","v":0},{"$f":"SUMIF(Data!$R:$R,$O44,Data!BF:BF)","v":0},{"$f":"SUMIF(Data!$R:$R,$O44,Data!BI:BI)","v":0},{"$f":"SUMIF(Data!$R:$R,$O44,Data!BL:BL)","v":0},{"$f":"SUMIF(Data!$R:$R,$O44,Data!BO:BO)","v":0},{"$f":"SUMIF(Data!$R:$R,$O44,Data!BR:BR)","v":0},{"$f":"SUMIF(Data!$R:$R,$O44,Data!BU:BU)","v":0},{"$f":"SUMIF(Data!$R:$R,$O44,Data!BX:BX)","v":0},{"$f":"SUMIF(Data!$R:$R,$O44,Data!CA:CA)","v":0},{"$f":"SUMIF(Data!$R:$R,$O44,Data!BD:BD)","v":0},{"$f":"SUMIF(Data!$R:$R,$O44,Data!BG:BG)","v":0},{"$f":"SUMIF(Data!$R:$R,$O44,Data!BJ:BJ)","v":0},{"$f":"SUMIF(Data!$R:$R,$O44,Data!BM:BM)","v":0},{"$f":"SUMIF(Data!$R:$R,$O44,Data!BP:BP)","v":0},{"$f":"SUMIF(Data!$R:$R,$O44,Data!BS:BS)","v":0},{"$f":"SUMIF(Data!$R:$R,$O44,Data!BV:BV)","v":0},{"$f":"SUMIF(Data!$R:$R,$O44,Data!BY:BY)","v":0},{"$f":"SUMIF(Data!$R:$R,$O44,Data!CB:CB)","v":0}]
[null,"Chipwi",{"$f":"COUNTIF(Data!R:R,B45)","v":3},{"$f":"COUNTIFS(Data!R:R,'Analysis Tables'!B45,Data!Y:Y,'Analysis Tables'!$D$42)","v":1},{"$f":"COUNTIFS(Data!R:R,'Analysis Tables'!B45,Data!Y:Y,'Analysis Tables'!$E$42)","v":0},{"$f":"COUNTIFS(Data!R:R,'Analysis Tables'!B45,Data!Y:Y,'Analysis Tables'!$F$42)","v":1},null,"Mongyai",{"$f":"COUNTIF(Data!R:R,H45)","v":0},{"$f":"COUNTIFS(Data!R:R,'Analysis Tables'!H45,Data!Y:Y,'Analysis Tables'!$J$42)","v":0},{"$f":"COUNTIFS(Data!R:R,'Analysis Tables'!H45,Data!Y:Y,'Analysis Tables'!$K$42)","v":0},{"$f":"COUNTIFS(Data!R:R,'Analysis Tables'!H45,Data!Y:Y,'Analysis Tables'!$L$42)","v":0},null,null,"Hopang",{"$f":"SUMIF(Data!$R:$R,$O45,Data!BC:BC)","v":0},{"$f":"SUMIF(Data!$R:$R,$O45,Data!BF:BF)","v":0},{"$f":"SUMIF(Data!$R:$R,$O45,Data!BI:BI)","v":0},{"$f":"SUMIF(Data!$R:$R,$O45,Data!BL:BL)","v":0},{"$f":"SUMIF(Data!$R:$R,$O45,Data!BO:BO)","v":0},{"$f":"SUMIF(Data!$R:$R,$O45,Data!BR:BR)","v":0},{"$f":"SUMIF(Data!$R:$R,$O45,Data!BU:BU)","v":0},{"$f":"SUMIF(Data!$R:$R,$O45,Data!BX:BX)","v":0},{"$f":"SUMIF(Data!$R:$R,$O45,Data!CA:CA)","v":0},{"$f":"SUMIF(Data!$R:$R,$O45,Data!BD:BD)","v":0},{"$f":"SUMIF(Data!$R:$R,$O45,Data!BG:BG)","v":0},{"$f":"SUMIF(Data!$R:$R,$O45,Data!BJ:BJ)","v":0},{"$f":"SUMIF(Data!$R:$R,$O45,Data!BM:BM)","v":0},{"$f":"SUMIF(Data!$R:$R,$O45,Data!BP:BP)","v":0},{"$f":"SUMIF(Data!$R:$R,$O45,Data!BS:BS)","v":0},{"$f":"SUMIF(Data!$R:$R,$O45,Data!BV:BV)","v":0},{"$f":"SUMIF(Data!$R:$R,$O45,Data!BY:BY)","v":0},{"$f":"SUMIF(Data!$R:$R,$O45,Data!CB:CB)","v":0}]
[null,"Sumprabum",{"$f":"COUNTIF(Data!R:R,B46)","v":0},{"$f":"COUNTIFS(Data!R:R,'Analysis Tables'!B46,Data!Y:Y,'Analysis Tables'!$D$42)","v":0},{"$f":"COUNTIFS(Data!R:R,'Analysis Tables'!B46,Data!Y:Y,'Analysis Tables'!$E$42)","v":0},{"$f":"COUNTIFS(Data!R:R,'Analysis Tables'!B46,Data!Y:Y,'Analysis Tables'!$F$42)","v":0},null,"Namhsan",{"$f":"COUNTIF(Data!R:R,H46)","v":0},{"$f":"COUNTIFS(Data!R:R,'Analysis Tables'!H46,Data!Y:Y,'Analysis Tables'!$J$42)","v":0},{"$f":"COUNTIFS(Data!R:R,'Analysis Tables'!H46,Data!Y:Y,'Analysis Tables'!$K$42)","v":0},{"$f":"COUNTIFS(Data!R:R,'Analysis Tables'!H46,Data!Y:Y,'Analysis Tables'!$L$42)","v":0},null,null,"Manton",{"$f":"SUMIF(Data!$R:$R,$O46,Data!BC:BC)","v":0},{"$f":"SUMIF(Data!$R:$R,$O46,Data!BF:BF)","v":5},{"$f":"SUMIF(Data!$R:$R,$O46,Data!BI:BI)","v":3},{"$f":"SUMIF(Data!$R:$R,$O46,Data!BL:BL)","v":20},{"$f":"SUMIF(Data!$R:$R,$O46,Data!BO:BO)","v":14},{"$f":"SUMIF(Data!$R:$R,$O46,Data!BR:BR)","v":16},{"$f":"SUMIF(Data!$R:$R,$O46,Data!BU:BU)","v":18},{"$f":"SUMIF(Data!$R:$R,$O46,Data!BX:BX)","v":7},{"$f":"SUMIF(Data!$R:$R,$O46,Data!CA:CA)","v":83},{"$f":"SUMIF(Data!$R:$R,$O46,Data!BD:BD)","v":0},{"$f":"SUMIF(Data!$R:$R,$O46,Data!BG:BG)","v":3},{"$f":"SUMIF(Data!$R:$R,$O46,Data!BJ:BJ)","v":7},{"$f":"SUMIF(Data!$R:$R,$O46,Data!BM:BM)","v":13},{"$f":"SUMIF(Data!$R:$R,$O46,Data!BP:BP)","v":15},{"$f":"SUMIF(Data!$R:$R,$O46,Data!BS:BS)","v":25},{"$f":"SUMIF(Data!$R:$R,$O46,Data!BV:BV)","v":27},{"$f":"SUMIF(Data!$R:$R,$O46,Data!BY:BY)","v":10},{"$f":"SUMIF(Data!$R:$R,$O46,Data!CB:CB)","v":100}]
[null,"Nawngmun",{"$f":"COUNTIF(Data!R:R,B47)","v":0},{"$f":"COUNTIFS(Data!R:R,'Analysis Tables'!B47,Data!Y:Y,'Analysis Tables'!$D$42)","v":0},{"$f":"COUNTIFS(Data!R:R,'Analysis Tables'!B47,Data!Y:Y,'Analysis Tables'!$E$42)","v":0},{"$f":"COUNTIFS(Data!R:R,'Analysis Tables'!B47,Data!Y:Y,'Analysis Tables'!$F$42)","v":0},null,"Hseni",{"$f":"COUNTIF(Data!R:R,H47)","v":1},{"$f":"COUNTIFS(Data!R:R,'Analysis Tables'!H47,Data!Y:Y,'Analysis Tables'!$J$42)","v":0},{"$f":"COUNTIFS(Data!R:R,'Analysis Tables'!H47,Data!Y:Y,'Analysis Tables'!$K$42)","v":1},{"$f":"COUNTIFS(Data!R:R,'Analysis Tables'!H47,Data!Y:Y,'Analysis Tables'!$L$42)","v":0},null,null,"Konkyan",{"$f":"SUMIF(Data!$R:$R,$O47,Data!BC:BC)","v":0},{"$f":"SUMIF(Data!$R:$R,$O47,Data!BF:BF)","v":0},{"$f":"SUMIF(Data!$R:$R,$O47,Data!BI:BI)","v":0},{"$f":"SUMIF(Data!$R:$R,$O47,Data!BL:BL)","v":0},{"$f":"SUMIF(Data!$R:$R,$O47,Data!BO:BO)","v":0},{"$f":"SUMIF(Data!$R:$R,$O47,Data!BR:BR)","v":0},{"$f":"SUMIF(Data!$R:$R,$O47,Data!BU:BU)","v":0},{"$f":"SUMIF(Data!$R:$R,$O47,Data!BX:BX)","v":0},{"$f":"SUMIF(Data!$R:$R,$O47,Data!CA:CA)","v":0},{"$f":"SUMIF(Data!$R:$R,$O47,Data!BD:BD)","v":0},{"$f":"SUMIF(Data!$R:$R,$O47,Data!BG:BG)","v":0},{"$f":"SUMIF(Data!$R:$R,$O47,Data!BJ:BJ)","v":0},{"$f":"SUMIF(Data!$R:$R,$O47,Data!BM:BM)","v":0},{"$f":"SUMIF(Data!$R:$R,$O47,Data!BP:BP)","v":0},{"$f":"SUMIF(Data!$R:$R,$O47,Data!BS:BS)","v":0},{"$f":"SUMIF(Data!$R:$R,$O47,Data!BV:BV)","v":0},{"$f":"SUMIF(Data!$R:$R,$O47,Data!BY:BY)","v":0},{"$f":"SUMIF(Data!$R:$R,$O47,Data!CB:CB)","v":0}]
[null,"Mansi",{"$f":"COUNTIF(Data!R:R,B48)","v":9},{"$f":"COUNTIFS(Data!R:R,'Analysis Tables'!B48,Data!Y:Y,'Analysis Tables'!$D$42)","v":1},{"$f":"COUNTIFS(Data!R:R,'Analysis Tables'!B48,Data!Y:Y,'Analysis Tables'!$E$42)","v":7},{"$f":"COUNTIFS(Data!R:R,'Analysis Tables'!B48,Data!Y:Y,'Analysis Tables'!$F$42)","v":1},null,"Laukkaing",{"$f":"COUNTIF(Data!R:R,H48)","v":0},{"$f":"COUNTIFS(Data!R:R,'Analysis Tables'!H48,Data!Y:Y,'Analysis Tables'!$J$42)","v":0},{"$f":"COUNTIFS(Data!R:R,'Analysis Tables'!H48,Data!Y:Y,'Analysis Tables'!$K$42)","v":0},{"$f":"COUNTIFS(Data!R:R,'Analysis Tables'!H48,Data!Y:Y,'Analysis Tables'!$L$42)","v":0},null,null,"Tangyan",{"$f":"SUMIF(Data!$R:$R,$O48,Data!BC:BC)","v":0},{"$f":"SUMIF(Data!$R:$R,$O48,Data!BF:BF)","v":0},{"$f":"SUMIF(Data!$R:$R,$O48,Data!BI:BI)","v":0},{"$f":"SUMIF(Data!$R:$R,$O48,Data!BL:BL)","v":0},{"$f":"SUMIF(Data!$R:$R,$O48,Data!BO:BO)","v":0},{"$f":"SUMIF(Data!$R:$R,$O48,Data!BR:BR)","v":0},{"$f":"SUMIF(Data!$R:$R,$O48,Data!BU:BU)","v":0},{"$f":"SUMIF(Data!$R:$R,$O48,Data!BX:BX)","v":0},{"$f":"SUMIF(Data!$R:$R,$O48,Data!CA:CA)","v":0},{"$f":"SUMIF(Data!$R:$R,$O48,Data!BD:BD)","v":0},{"$f":"SUMIF(Data!$R:$R,$O48,Data!BG:BG)","v":0},{"$f":"SUMIF(Data!$R:$R,$O48,Data!BJ:BJ)","v":0},{"$f":"SUMIF(Data!$R:$R,$O48,Data!BM:BM)","v":0},{"$f":"SUMIF(Data!$R:$R,$O48,Data!BP:BP)","v":0},{"$f":"SUMIF(Data!$R:$R,$O48,Data!BS:BS)","v":0},{"$f":"SUMIF(Data!$R:$R,$O48,Data!BV:BV)","v":0},{"$f":"SUMIF(Data!$R:$R,$O48,Data!BY:BY)","v":0},{"$f":"SUMIF(Data!$R:$R,$O48,Data!CB:CB)","v":0}]
[null,"Myitkyina",{"$f":"COUNTIF(Data!R:R,B49)","v":25},{"$f":"COUNTIFS(Data!R:R,'Analysis Tables'!B49,Data!Y:Y,'Analysis Tables'!$D$42)","v":22},{"$f":"COUNTIFS(Data!R:R,'Analysis Tables'!B49,Data!Y:Y,'Analysis Tables'!$E$42)","v":2},{"$f":"COUNTIFS(Data!R:R,'Analysis Tables'!B49,Data!Y:Y,'Analysis Tables'!$F$42)","v":0},null,"Muse",{"$f":"COUNTIF(Data!R:R,H49)","v":1},{"$f":"COUNTIFS(Data!R:R,'Analysis Tables'!H49,Data!Y:Y,'Analysis Tables'!$J$42)","v":1},{"$f":"COUNTIFS(Data!R:R,'Analysis Tables'!H49,Data!Y:Y,'Analysis Tables'!$K$42)","v":0},{"$f":"COUNTIFS(Data!R:R,'Analysis Tables'!H49,Data!Y:Y,'Analysis Tables'!$L$42)","v":0},null,null,"Namhkan",{"$f":"SUMIF(Data!$R:$R,$O49,Data!BC:BC)","v":6},{"$f":"SUMIF(Data!$R:$R,$O49,Data!BF:BF)","v":24},{"$f":"SUMIF(Data!$R:$R,$O49,Data!BI:BI)","v":47},{"$f":"SUMIF(Data!$R:$R,$O49,Data!BL:BL)","v":135},{"$f":"SUMIF(Data!$R:$R,$O49,Data!BO:BO)","v":78},{"$f":"SUMIF(Data!$R:$R,$O49,Data!BR:BR)","v":82},{"$f":"SUMIF(Data!$R:$R,$O49,Data!BU:BU)","v":99},{"$f":"SUMIF(Data!$R:$R,$O49,Data!BX:BX)","v":21},{"$f":"SUMIF(Data!$R:$R,$O49,Data!CA:CA)","v":492},{"$f":"SUMIF(Data!$R:$R,$O49,Data!BD:BD)","v":9},{"$f":"SUMIF(Data!$R:$R,$O49,Data!BG:BG)","v":25},{"$f":"SUMIF(Data!$R:$R,$O49,Data!BJ:BJ)","v":41},{"$f":"SUMIF(Data!$R:$R,$O49,Data!BM:BM)","v":129},{"$f":"SUMIF(Data!$R:$R,$O49,Data!BP:BP)","v":72},{"$f":"SUMIF(Data!$R:$R,$O49,Data!BS:BS)","v":113},{"$f":"SUMIF(Data!$R:$R,$O49,Data!BV:BV)","v":106},{"$f":"SUMIF(Data!$R:$R,$O49,Data!BY:BY)","v":36},{"$f":"SUMIF(Data!$R:$R,$O49,Data!CB:CB)","v":531}]
[null,"Khaunglanhpu",{"$f":"COUNTIF(Data!R:R,B50)","v":0},{"$f":"COUNTIFS(Data!R:R,'Analysis Tables'!B50,Data!Y:Y,'Analysis Tables'!$D$42)","v":0},{"$f":"COUNTIFS(Data!R:R,'Analysis Tables'!B50,Data!Y:Y,'Analysis Tables'!$E$42)","v":0},{"$f":"COUNTIFS(Data!R:R,'Analysis Tables'!B50,Data!Y:Y,'Analysis Tables'!$F$42)","v":0},null,"Mabein",{"$f":"COUNTIF(Data!R:R,H50)","v":0},{"$f":"COUNTIFS(Data!R:R,'Analysis Tables'!H50,Data!Y:Y,'Analysis Tables'!$J$42)","v":0},{"$f":"COUNTIFS(Data!R:R,'Analysis Tables'!H50,Data!Y:Y,'Analysis Tables'!$K$42)","v":0},{"$f":"COUNTIFS(Data!R:R,'Analysis Tables'!H50,Data!Y:Y,'Analysis Tables'!$L$42)","v":0},null,null,"Mongmao",{"$f":"SUMIF(Data!$R:$R,$O50,Data!BC:BC)","v":0},{"$f":"SUMIF(Data!$R:$R,$O50,Data!BF:BF)","v":0},{"$f":"SUMIF(Data!$R:$R,$O50,Data!BI:BI)","v":0},{"$f":"SUMIF(Data!$R:$R,$O50,Data!BL:BL)","v":0},{"$f":"SUMIF(Data!$R:$R,$O50,Data!BO:BO)","v":0},{"$f":"SUMIF(Data!$R:$R,$O50,Data!BR:BR)","v":0},{"$f":"SUMIF(Data!$R:$R,$O50,Data!BU:BU)","v":0},{"$f":"SUMIF(Data!$R:$R,$O50,Data!BX:BX)","v":0},{"$f":"SUMIF(Data!$R:$R,$O50,Data!CA:CA)","v":0},{"$f":"SUMIF(Data!$R:$R,$O50,Data!BD:BD)","v":0},{"$f":"SUMIF(Data!$R:$R,$O50,Data!BG:BG)","v":0},{"$f":"SUMIF(Data!$R:$R,$O50,Data!BJ:BJ)","v":0},{"$f":"SUMIF(Data!$R:$R,$O50,Data!BM:BM)","v":0},{"$f":"SUMIF(Data!$R:$R,$O50,Data!BP:BP)","v":0},{"$f":"SUMIF(Data!$R:$R,$O50,Data!BS:BS)","v":0},{"$f":"SUMIF(Data!$R:$R,$O50,Data!BV:BV)","v":0},{"$f":"SUMIF(Data!$R:$R,$O50,Data!BY:BY)","v":0},{"$f":"SUMIF(Data!$R:$R,$O50,Data!CB:CB)","v":0}]
[null,"Puta-O",{"$f":"COUNTIF(Data!R:R,B51)","v":0},{"$f":"COUNTIFS(Data!R:R,'Analysis Tables'!B51,Data!Y:Y,'Analysis Tables'!$D$42)","v":0},{"$f":"COUNTIFS(Data!R:R,'Analysis Tables'!B51,Data!Y:Y,'Analysis Tables'!$E$42)","v":0},{"$f":"COUNTIFS(Data!R:R,'Analysis Tables'!B51,Data!Y:Y,'Analysis Tables'!$F$42)","v":0},null,"Kyaukme",{"$f":"COUNTIF(Data!R:R,H51)","v":0},{"$f":"COUNTIFS(Data!R:R,'Analysis Tables'!H51,Data!Y:Y,'Analysis Tables'!$J$42)","v":0},{"$f":"COUNTIFS(Data!R:R,'Analysis Tables'!H51,Data!Y:Y,'Analysis Tables'!$K$42)","v":0},{"$f":"COUNTIFS(Data!R:R,'Analysis Tables'!H51,Data!Y:Y,'Analysis Tables'!$L$42)","v":0},null,null,"TOTALS",{"$f":"SUM(P27:P50)","v":32},{"$f":"SUM(Q27:Q50)","v":100},167,457,315,346,344,97,1858,28,117,183,468,263,465,467,142,2133]
[null,"Shwegu",{"$f":"COUNTIF(Data!R:R,B52)","v":2},{"$f":"COUNTIFS(Data!R:R,'Analysis Tables'!B52,Data!Y:Y,'Analysis Tables'!$D$42)","v":2},{"$f":"COUNTIFS(Data!R:R,'Analysis Tables'!B52,Data!Y:Y,'Analysis Tables'!$E$42)","v":0},{"$f":"COUNTIFS(Data!R:R,'Analysis Tables'!B52,Data!Y:Y,'Analysis Tables'!$F$42)","v":0},null,"Lashio",{"$f":"COUNTIF(Data!R:R,H52)","v":0},{"$f":"COUNTIFS(Data!R:R,'Analysis Tables'!H52,Data!Y:Y,'Analysis Tables'!$J$42)","v":0},{"$f":"COUNTIFS(Data!R:R,'Analysis Tables'!H52,Data!Y:Y,'Analysis Tables'!$K$42)","v":0},{"$f":"COUNTIFS(Data!R:R,'Analysis Tables'!H52,Data!Y:Y,'Analysis Tables'!$L$42)","v":0},null,"OVERALL TOTALS",null,{"$f":"P51+P26","v":546},{"$f":"Q51+Q26","v":1371},2846,7204,5898,6788,6614,1907,33174,577,1314,2884,6835,5958,8422,8369,2604,36963]
[null,"Injangyang",{"$f":"COUNTIF(Data!R:R,B53)","v":0},{"$f":"COUNTIFS(Data!R:R,'Analysis Tables'!B53,Data!Y:Y,'Analysis Tables'!$D$42)","v":0},{"$f":"COUNTIFS(Data!R:R,'Analysis Tables'!B53,Data!Y:Y,'Analysis Tables'!$E$42)","v":0},{"$f":"COUNTIFS(Data!R:R,'Analysis Tables'!B53,Data!Y:Y,'Analysis Tables'!$F$42)","v":0},null,"Kunlong",{"$f":"COUNTIF(Data!R:R,H53)","v":0},{"$f":"COUNTIFS(Data!R:R,'Analysis Tables'!H53,Data!Y:Y,'Analysis Tables'!$J$42)","v":0},{"$f":"COUNTIFS(Data!R:R,'Analysis Tables'!H53,Data!Y:Y,'Analysis Tables'!$K$42)","v":0},{"$f":"COUNTIFS(Data!R:R,'Analysis Tables'!H53,Data!Y:Y,'Analysis Tables'!$L$42)","v":0},null,null,null,{"$f":"-(P52/$X$52)","v":-1.6458672454331705E-2},{"$f":"-(Q52/$X$52)","v":-4.1327545668294448E-2},-8.5790076565985404E-2,-0.21715801531319709,-0.17778983541327545,-0.20461807439561103,-0.19937300295412069,-5.7484777235184178E-2,null,{"$f":"Y52/$AG$52","v":1.5610204799393989E-2},{"$f":"Z52/$AG$52","v":3.5549062576089606E-2},7.8023969915861802E-2,0.18491464437410382,0.16118821524226928,0.22784947109271433,0.22641560479398318,7.0448827205583958E-2]
[null,"Tanai",{"$f":"COUNTIF(Data!R:R,B54)","v":0},{"$f":"COUNTIFS(Data!R:R,'Analysis Tables'!B54,Data!Y:Y,'Analysis Tables'!$D$42)","v":0},{"$f":"COUNTIFS(Data!R:R,'Analysis Tables'!B54,Data!Y:Y,'Analysis Tables'!$E$42)","v":0},{"$f":"COUNTIFS(Data!R:R,'Analysis Tables'!B54,Data!Y:Y,'Analysis Tables'!$F$42)","v":0},null,"Matman",{"$f":"COUNTIF(Data!R:R,H54)","v":0},{"$f":"COUNTIFS(Data!R:R,'Analysis Tables'!H54,Data!Y:Y,'Analysis Tables'!$J$42)","v":0},{"$f":"COUNTIFS(Data!R:R,'Analysis Tables'!H54,Data!Y:Y,'Analysis Tables'!$K$42)","v":0},{"$f":"COUNTIFS(Data!R:R,'Analysis Tables'!H54,Data!Y:Y,'Analysis Tables'!$L$42)","v":0},null,"VULNERABLE POPULATIONS IN CAMPS"]
[null,"Bhamo",{"$f":"COUNTIF(Data!R:R,B55)","v":10},{"$f":"COUNTIFS(Data!R:R,'Analysis Tables'!B55,Data!Y:Y,'Analysis Tables'!$D$42)","v":9},{"$f":"COUNTIFS(Data!R:R,'Analysis Tables'!B55,Data!Y:Y,'Analysis Tables'!$E$42)","v":1},{"$f":"COUNTIFS(Data!R:R,'Analysis Tables'!B55,Data!Y:Y,'Analysis Tables'!$F$42)","v":0},null,"Namtu",{"$f":"COUNTIF(Data!R:R,H55)","v":1},{"$f":"COUNTIFS(Data!R:R,'Analysis Tables'!H55,Data!Y:Y,'Analysis Tables'!$J$42)","v":1},{"$f":"COUNTIFS(Data!R:R,'Analysis Tables'!H55,Data!Y:Y,'Analysis Tables'!$K$42)","v":0},{"$f":"COUNTIFS(Data!R:R,'Analysis Tables'!H55,Data!Y:Y,'Analysis Tables'!$L$42)","v":0},null,"State","Townships","Physically Disabled ","Mentally Disabled ","Chronically ill ","Unaccompanied children (<18) ","Separated children (<18) ","Unaccompanied elders (>60) ","Single headed households ","Male Totals","Physically Disabled ","Mentally Disabled ","Chronically ill ","Unaccompanied children (<18) ","Separated children (<18) ","Unaccompanied elders (>60) ","Single headed households ","Pregnant women","Lactating women","Female Totals"]
[null,"Mohnyin",{"$f":"COUNTIF(Data!R:R,B56)","v":1},{"$f":"COUNTIFS(Data!R:R,'Analysis Tables'!B56,Data!Y:Y,'Analysis Tables'!$D$42)","v":0},{"$f":"COUNTIFS(Data!R:R,'Analysis Tables'!B56,Data!Y:Y,'Analysis Tables'!$E$42)","v":1},{"$f":"COUNTIFS(Data!R:R,'Analysis Tables'!B56,Data!Y:Y,'Analysis Tables'!$F$42)","v":0},null,"Mongmit",{"$f":"COUNTIF(Data!R:R,H56)","v":0},{"$f":"COUNTIFS(Data!R:R,'Analysis Tables'!H56,Data!Y:Y,'Analysis Tables'!$J$42)","v":0},{"$f":"COUNTIFS(Data!R:R,'Analysis Tables'!H56,Data!Y:Y,'Analysis Tables'!$K$42)","v":0},{"$f":"COUNTIFS(Data!R:R,'Analysis Tables'!H56,Data!Y:Y,'Analysis Tables'!$L$42)","v":0},null,"Kachin","Momauk",{"$f":"SUMIF(Data!$R:$R,$O56,Data!CD:CD)","v":76},{"$f":"SUMIF(Data!$R:$R,$O56,Data!CG:CG)","v":2},{"$f":"SUMIF(Data!$R:$R,$O56,Data!CJ:CJ)","v":42},{"$f":"SUMIF(Data!$R:$R,$O56,Data!CM:CM)","v":20},{"$f":"SUMIF(Data!$R:$R,$O56,Data!CP:CP)","v":516},{"$f":"SUMIF(Data!$R:$R,$O56,Data!CS:CS)","v":34},{"$f":"SUMIF(Data!$R:$R,$O56,Data!CV:CV)","v":11},{"$f":"SUM(P56:V56)","v":701},{"$f":"SUMIF(Data!$R:$R,$O56,Data!CE:CE)","v":36},{"$f":"SUMIF(Data!$R:$R,$O56,Data!CH:CH)","v":3},{"$f":"SUMIF(Data!$R:$R,$O56,Data!CK:CK)","v":53},{"$f":"SUMIF(Data!$R:$R,$O56,Data!CN:CN)","v":19},{"$f":"SUMIF(Data!$R:$R,$O56,Data!CQ:CQ)","v":590},{"$f":"SUMIF(Data!$R:$R,$O56,Data!CT:CT)","v":49},{"$f":"SUMIF(Data!$R:$R,$O56,Data!CW:CW)","v":609},{"$f":"SUMIF(Data!$R:$R,$O56,Data!CY:CY)","v":216},{"$f":"SUMIF(Data!$R:$R,$O56,Data!CZ:CZ)","v":343},{"$f":"SUM(X56:AF56)","v":1918}]
[null,"Waingmaw",{"$f":"COUNTIF(Data!R:R,B57)","v":21},{"$f":"COUNTIFS(Data!R:R,'Analysis Tables'!B57,Data!Y:Y,'Analysis Tables'!$D$42)","v":7},{"$f":"COUNTIFS(Data!R:R,'Analysis Tables'!B57,Data!Y:Y,'Analysis Tables'!$E$42)","v":9},{"$f":"COUNTIFS(Data!R:R,'Analysis Tables'!B57,Data!Y:Y,'Analysis Tables'!$F$42)","v":2},null,"Kutkai",{"$f":"COUNTIF(Data!R:R,H57)","v":8},{"$f":"COUNTIFS(Data!R:R,'Analysis Tables'!H57,Data!Y:Y,'Analysis Tables'!$J$42)","v":2},{"$f":"COUNTIFS(Data!R:R,'Analysis Tables'!H57,Data!Y:Y,'Analysis Tables'!$K$42)","v":6},{"$f":"COUNTIFS(Data!R:R,'Analysis Tables'!H57,Data!Y:Y,'Analysis Tables'!$L$42)","v":0},null,null,"Mogaung",{"$f":"SUMIF(Data!$R:$R,$O57,Data!CD:CD)","v":2},{"$f":"SUMIF(Data!$R:$R,$O57,Data!CG:CG)","v":0},{"$f":"SUMIF(Data!$R:$R,$O57,Data!CJ:CJ)","v":0},{"$f":"SUMIF(Data!$R:$R,$O57,Data!CM:CM)","v":3},{"$f":"SUMIF(Data!$R:$R,$O57,Data!CP:CP)","v":1},{"$f":"SUMIF(Data!$R:$R,$O57,Data!CS:CS)","v":0},{"$f":"SUMIF(Data!$R:$R,$O57,Data!CV:CV)","v":1},{"$f":"SUM(P57:V57)","v":7},{"$f":"SUMIF(Data!$R:$R,$O57,Data!CE:CE)","v":0},{"$f":"SUMIF(Data!$R:$R,$O57,Data!CH:CH)","v":0},{"$f":"SUMIF(Data!$R:$R,$O57,Data!CK:CK)","v":1},{"$f":"SUMIF(Data!$R:$R,$O57,Data!CN:CN)","v":0},{"$f":"SUMIF(Data!$R:$R,$O57,Data!CQ:CQ)","v":0},{"$f":"SUMIF(Data!$R:$R,$O57,Data!CT:CT)","v":1},{"$f":"SUMIF(Data!$R:$R,$O57,Data!CW:CW)","v":7},{"$f":"SUMIF(Data!$R:$R,$O57,Data!CY:CY)","v":3},{"$f":"SUMIF(Data!$R:$R,$O57,Data!CZ:CZ)","v":10},{"$f":"SUM(X57:AF57)","v":22}]
[null,"Tsawlaw",{"$f":"COUNTIF(Data!R:R,B58)","v":0},{"$f":"COUNTIFS(Data!R:R,'Analysis Tables'!B58,Data!Y:Y,'Analysis Tables'!$D$42)","v":0},{"$f":"COUNTIFS(Data!R:R,'Analysis Tables'!B58,Data!Y:Y,'Analysis Tables'!$E$42)","v":0},{"$f":"COUNTIFS(Data!R:R,'Analysis Tables'!B58,Data!Y:Y,'Analysis Tables'!$F$42)","v":0},null,"Hsipaw",{"$f":"COUNTIF(Data!R:R,H58)","v":0},{"$f":"COUNTIFS(Data!R:R,'Analysis Tables'!H58,Data!Y:Y,'Analysis Tables'!$J$42)","v":0},{"$f":"COUNTIFS(Data!R:R,'Analysis Tables'!H58,Data!Y:Y,'Analysis Tables'!$K$42)","v":0},{"$f":"COUNTIFS(Data!R:R,'Analysis Tables'!H58,Data!Y:Y,'Analysis Tables'!$L$42)","v":0},null,null,"Chipwi",{"$f":"SUMIF(Data!$R:$R,$O58,Data!CD:CD)","v":8},{"$f":"SUMIF(Data!$R:$R,$O58,Data!CG:CG)","v":1},{"$f":"SUMIF(Data!$R:$R,$O58,Data!CJ:CJ)","v":6},{"$f":"SUMIF(Data!$R:$R,$O58,Data!CM:CM)","v":0},{"$f":"SUMIF(Data!$R:$R,$O58,Data!CP:CP)","v":2},{"$f":"SUMIF(Data!$R:$R,$O58,Data!CS:CS)","v":0},{"$f":"SUMIF(Data!$R:$R,$O58,Data!CV:CV)","v":0},17,{"$f":"SUMIF(Data!$R:$R,$O58,Data!CE:CE)","v":3},{"$f":"SUMIF(Data!$R:$R,$O58,Data!CH:CH)","v":2},{"$f":"SUMIF(Data!$R:$R,$O58,Data!CK:CK)","v":11},{"$f":"SUMIF(Data!$R:$R,$O58,Data!CN:CN)","v":0},{"$f":"SUMIF(Data!$R:$R,$O58,Data!CQ:CQ)","v":3},{"$f":"SUMIF(Data!$R:$R,$O58,Data!CT:CT)","v":6},{"$f":"SUMIF(Data!$R:$R,$O58,Data!CW:CW)","v":20},{"$f":"SUMIF(Data!$R:$R,$O58,Data!CY:CY)","v":15},{"$f":"SUMIF(Data!$R:$R,$O58,Data!CZ:CZ)","v":87},147]
[null,"Machanbaw",{"$f":"COUNTIF(Data!R:R,B59)","v":0},{"$f":"COUNTIFS(Data!R:R,'Analysis Tables'!B59,Data!Y:Y,'Analysis Tables'!$D$42)","v":0},{"$f":"COUNTIFS(Data!R:R,'Analysis Tables'!B59,Data!Y:Y,'Analysis Tables'!$E$42)","v":0},{"$f":"COUNTIFS(Data!R:R,'Analysis Tables'!B59,Data!Y:Y,'Analysis Tables'!$F$42)","v":0},null,"Pangsang",{"$f":"COUNTIF(Data!R:R,H59)","v":0},{"$f":"COUNTIFS(Data!R:R,'Analysis Tables'!H59,Data!Y:Y,'Analysis Tables'!$J$42)","v":0},{"$f":"COUNTIFS(Data!R:R,'Analysis Tables'!H59,Data!Y:Y,'Analysis Tables'!$K$42)","v":0},{"$f":"COUNTIFS(Data!R:R,'Analysis Tables'!H59,Data!Y:Y,'Analysis Tables'!$L$42)","v":0},null,null,"Sumprabum",{"$f":"SUMIF(Data!$R:$R,$O59,Data!CD:CD)","v":0},{"$f":"SUMIF(Data!$R:$R,$O59,Data!CG:CG)","v":0},{"$f":"SUMIF(Data!$R:$R,$O59,Data!CJ:CJ)","v":0},{"$f":"SUMIF(Data!$R:$R,$O59,Data!CM:CM)","v":0},{"$f":"SUMIF(Data!$R:$R,$O59,Data!CP:CP)","v":0},{"$f":"SUMIF(Data!$R:$R,$O59,Data!CS:CS)","v":0},{"$f":"SUMIF(Data!$R:$R,$O59,Data!CV:CV)","v":0},0,{"$f":"SUMIF(Data!$R:$R,$O59,Data!CE:CE)","v":0},{"$f":"SUMIF(Data!$R:$R,$O59,Data!CH:CH)","v":0},{"$f":"SUMIF(Data!$R:$R,$O59,Data!CK:CK)","v":0},{"$f":"SUMIF(Data!$R:$R,$O59,Data!CN:CN)","v":0},{"$f":"SUMIF(Data!$R:$R,$O59,Data!CQ:CQ)","v":0},{"$f":"SUMIF(Data!$R:$R,$O59,Data!CT:CT)","v":0},{"$f":"SUMIF(Data!$R:$R,$O59,Data!CW:CW)","v":0},{"$f":"SUMIF(Data!$R:$R,$O59,Data!CY:CY)","v":0},{"$f":"SUMIF(Data!$R:$R,$O59,Data!CZ:CZ)","v":0},0]
[null,"Hpakant",{"$f":"COUNTIF(Data!R:R,B60)","v":22},{"$f":"COUNTIFS(Data!R:R,'Analysis Tables'!B60,Data!Y:Y,'Analysis Tables'!$D$42)","v":4},{"$f":"COUNTIFS(Data!R:R,'Analysis Tables'!B60,Data!Y:Y,'Analysis Tables'!$E$42)","v":17},{"$f":"COUNTIFS(Data!R:R,'Analysis Tables'!B60,Data!Y:Y,'Analysis Tables'!$F$42)","v":0},null,"Pangwaun",{"$f":"COUNTIF(Data!R:R,H60)","v":0},{"$f":"COUNTIFS(Data!R:R,'Analysis Tables'!H60,Data!Y:Y,'Analysis Tables'!$J$42)","v":0},{"$f":"COUNTIFS(Data!R:R,'Analysis Tables'!H60,Data!Y:Y,'Analysis Tables'!$K$42)","v":0},{"$f":"COUNTIFS(Data!R:R,'Analysis Tables'!H60,Data!Y:Y,'Analysis Tables'!$L$42)","v":0},null,null,"Nawngmun",{"$f":"SUMIF(Data!$R:$R,$O60,Data!CD:CD)","v":0},{"$f":"SUMIF(Data!$R:$R,$O60,Data!CG:CG)","v":0},{"$f":"SUMIF(Data!$R:$R,$O60,Data!CJ:CJ)","v":0},{"$f":"SUMIF(Data!$R:$R,$O60,Data!CM:CM)","v":0},{"$f":"SUMIF(Data!$R:$R,$O60,Data!CP:CP)","v":0},{"$f":"SUMIF(Data!$R:$R,$O60,Data!CS:CS)","v":0},{"$f":"SUMIF(Data!$R:$R,$O60,Data!CV:CV)","v":0},0,{"$f":"SUMIF(Data!$R:$R,$O60,Data!CE:CE)","v":0},{"$f":"SUMIF(Data!$R:$R,$O60,Data!CH:CH)","v":0},{"$f":"SUMIF(Data!$R:$R,$O60,Data!CK:CK)","v":0},{"$f":"SUMIF(Data!$R:$R,$O60,Data!CN:CN)","v":0},{"$f":"SUMIF(Data!$R:$R,$O60,Data!CQ:CQ)","v":0},{"$f":"SUMIF(Data!$R:$R,$O60,Data!CT:CT)","v":0},{"$f":"SUMIF(Data!$R:$R,$O60,Data!CW:CW)","v":0},{"$f":"SUMIF(Data!$R:$R,$O60,Data!CY:CY)","v":0},{"$f":"SUMIF(Data!$R:$R,$O60,Data!CZ:CZ)","v":0},0]
[null,"TOTALS",{"$f":"SUM(C43:C60)","v":110},{"$f":"SUM(D43:D60)","v":58},{"$f":"SUM(E43:E60)","v":41},{"$f":"SUM(F43:F60)","v":5},null,"Hopang",{"$f":"COUNTIF(Data!R:R,H61)","v":0},{"$f":"COUNTIFS(Data!R:R,'Analysis Tables'!H61,Data!Y:Y,'Analysis Tables'!$J$42)","v":0},{"$f":"COUNTIFS(Data!R:R,'Analysis Tables'!H61,Data!Y:Y,'Analysis Tables'!$K$42)","v":0},{"$f":"COUNTIFS(Data!R:R,'Analysis Tables'!H61,Data!Y:Y,'Analysis Tables'!$L$42)","v":0},null,null,"Mansi",{"$f":"SUMIF(Data!$R:$R,$O61,Data!CD:CD)","v":44},{"$f":"SUMIF(Data!$R:$R,$O61,Data!CG:CG)","v":92},{"$f":"SUMIF(Data!$R:$R,$O61,Data!CJ:CJ)","v":27},{"$f":"SUMIF(Data!$R:$R,$O61,Data!CM:CM)","v":4},{"$f":"SUMIF(Data!$R:$R,$O61,Data!CP:CP)","v":76},{"$f":"SUMIF(Data!$R:$R,$O61,Data!CS:CS)","v":15},{"$f":"SUMIF(Data!$R:$R,$O61,Data!CV:CV)","v":132},390,{"$f":"SUMIF(Data!$R:$R,$O61,Data!CE:CE)","v":39},{"$f":"SUMIF(Data!$R:$R,$O61,Data!CH:CH)","v":55},{"$f":"SUMIF(Data!$R:$R,$O61,Data!CK:CK)","v":28},{"$f":"SUMIF(Data!$R:$R,$O61,Data!CN:CN)","v":9},{"$f":"SUMIF(Data!$R:$R,$O61,Data!CQ:CQ)","v":90},{"$f":"SUMIF(Data!$R:$R,$O61,Data!CT:CT)","v":27},{"$f":"SUMIF(Data!$R:$R,$O61,Data!CW:CW)","v":189},{"$f":"SUMIF(Data!$R:$R,$O61,Data!CY:CY)","v":72},{"$f":"SUMIF(Data!$R:$R,$O61,Data!CZ:CZ)","v":300},809]
[null,null,null,null,null,null,null,"Manton",{"$f":"COUNTIF(Data!R:R,H62)","v":1},{"$f":"COUNTIFS(Data!R:R,'Analysis Tables'!H62,Data!Y:Y,'Analysis Tables'!$J$42)","v":1},{"$f":"COUNTIFS(Data!R:R,'Analysis Tables'!H62,Data!Y:Y,'Analysis Tables'!$K$42)","v":0},{"$f":"COUNTIFS(Data!R:R,'Analysis Tables'!H62,Data!Y:Y,'Analysis Tables'!$L$42)","v":0},null,null,"Myitkyina",{"$f":"SUMIF(Data!$R:$R,$O62,Data!CD:CD)","v":26},{"$f":"SUMIF(Data!$R:$R,$O62,Data!CG:CG)","v":11},{"$f":"SUMIF(Data!$R:$R,$O62,Data!CJ:CJ)","v":24},{"$f":"SUMIF(Data!$R:$R,$O62,Data!CM:CM)","v":50},{"$f":"SUMIF(Data!$R:$R,$O62,Data!CP:CP)","v":9},{"$f":"SUMIF(Data!$R:$R,$O62,Data!CS:CS)","v":16},{"$f":"SUMIF(Data!$R:$R,$O62,Data!CV:CV)","v":11},147,{"$f":"SUMIF(Data!$R:$R,$O62,Data!CE:CE)","v":15},{"$f":"SUMIF(Data!$R:$R,$O62,Data!CH:CH)","v":5},{"$f":"SUMIF(Data!$R:$R,$O62,Data!CK:CK)","v":23},{"$f":"SUMIF(Data!$R:$R,$O62,Data!CN:CN)","v":49},{"$f":"SUMIF(Data!$R:$R,$O62,Data!CQ:CQ)","v":10},{"$f":"SUMIF(Data!$R:$R,$O62,Data!CT:CT)","v":36},{"$f":"SUMIF(Data!$R:$R,$O62,Data!CW:CW)","v":76},{"$f":"SUMIF(Data!$R:$R,$O62,Data!CY:CY)","v":66},{"$f":"SUMIF(Data!$R:$R,$O62,Data!CZ:CZ)","v":130},410]
[null,"CAMP LOCATION TYPE - ALL CAMPS",null,null,null,null,null,"Konkyan",{"$f":"COUNTIF(Data!R:R,H63)","v":0},{"$f":"COUNTIFS(Data!R:R,'Analysis Tables'!H63,Data!Y:Y,'Analysis Tables'!$J$42)","v":0},{"$f":"COUNTIFS(Data!R:R,'Analysis Tables'!H63,Data!Y:Y,'Analysis Tables'!$K$42)","v":0},{"$f":"COUNTIFS(Data!R:R,'Analysis Tables'!H63,Data!Y:Y,'Analysis Tables'!$L$42)","v":0},null,null,"Khaunglanhpu",{"$f":"SUMIF(Data!$R:$R,$O63,Data!CD:CD)","v":0},{"$f":"SUMIF(Data!$R:$R,$O63,Data!CG:CG)","v":0},{"$f":"SUMIF(Data!$R:$R,$O63,Data!CJ:CJ)","v":0},{"$f":"SUMIF(Data!$R:$R,$O63,Data!CM:CM)","v":0},{"$f":"SUMIF(Data!$R:$R,$O63,Data!CP:CP)","v":0},{"$f":"SUMIF(Data!$R:$R,$O63,Data!CS:CS)","v":0},{"$f":"SUMIF(Data!$R:$R,$O63,Data!CV:CV)","v":0},0,{"$f":"SUMIF(Data!$R:$R,$O63,Data!CE:CE)","v":0},{"$f":"SUMIF(Data!$R:$R,$O63,Data!CH:CH)","v":0},{"$f":"SUMIF(Data!$R:$R,$O63,Data!CK:CK)","v":0},{"$f":"SUMIF(Data!$R:$R,$O63,Data!CN:CN)","v":0},{"$f":"SUMIF(Data!$R:$R,$O63,Data!CQ:CQ)","v":0},{"$f":"SUMIF(Data!$R:$R,$O63,Data!CT:CT)","v":0},{"$f":"SUMIF(Data!$R:$R,$O63,Data!CW:CW)","v":0},{"$f":"SUMIF(Data!$R:$R,$O63,Data!CY:CY)","v":0},{"$f":"SUMIF(Data!$R:$R,$O63,Data!CZ:CZ)","v":0},0]
[null,"Townships","Total Number of Camps","Urban","Rural","Forest/bush",null,"Tangyan",{"$f":"COUNTIF(Data!R:R,H64)","v":0},{"$f":"COUNTIFS(Data!R:R,'Analysis Tables'!H64,Data!Y:Y,'Analysis Tables'!$J$42)","v":0},{"$f":"COUNTIFS(Data!R:R,'Analysis Tables'!H64,Data!Y:Y,'Analysis Tables'!$K$42)","v":0},{"$f":"COUNTIFS(Data!R:R,'Analysis Tables'!H64,Data!Y:Y,'Analysis Tables'!$L$42)","v":0},null,null,"Puta-O",{"$f":"SUMIF(Data!$R:$R,$O64,Data!CD:CD)","v":0},{"$f":"SUMIF(Data!$R:$R,$O64,Data!CG:CG)","v":0},{"$f":"SUMIF(Data!$R:$R,$O64,Data!CJ:CJ)","v":0},{"$f":"SUMIF(Data!$R:$R,$O64,Data!CM:CM)","v":0},{"$f":"SUMIF(Data!$R:$R,$O64,Data!CP:CP)","v":0},{"$f":"SUMIF(Data!$R:$R,$O64,Data!CS:CS)","v":0},{"$f":"SUMIF(Data!$R:$R,$O64,Data!CV:CV)","v":0},0,{"$f":"SUMIF(Data!$R:$R,$O64,Data!CE:CE)","v":0},{"$f":"SUMIF(Data!$R:$R,$O64,Data!CH:CH)","v":0},{"$f":"SUMIF(Data!$R:$R,$O64,Data!CK:CK)","v":0},{"$f":"SUMIF(Data!$R:$R,$O64,Data!CN:CN)","v":0},{"$f":"SUMIF(Data!$R:$R,$O64,Data!CQ:CQ)","v":0},{"$f":"SUMIF(Data!$R:$R,$O64,Data!CT:CT)","v":0},{"$f":"SUMIF(Data!$R:$R,$O64,Data!CW:CW)","v":0},{"$f":"SUMIF(Data!$R:$R,$O64,Data!CY:CY)","v":0},{"$f":"SUMIF(Data!$R:$R,$O64,Data!CZ:CZ)","v":0},0]
[null,"Kachin",{"$f":"COUNTIF(Data!Q:Q,B65)","v":110},{"$f":"D61","v":58},{"$f":"E61","v":41},{"$f":"F61","v":5},null,"Namhkan",{"$f":"COUNTIF(Data!R:R,H65)","v":4},{"$f":"COUNTIFS(Data!R:R,'Analysis Tables'!H65,Data!Y:Y,'Analysis Tables'!$J$42)","v":3},{"$f":"COUNTIFS(Data!R:R,'Analysis Tables'!H65,Data!Y:Y,'Analysis Tables'!$K$42)","v":1},{"$f":"COUNTIFS(Data!R:R,'Analysis Tables'!H65,Data!Y:Y,'Analysis Tables'!$L$42)","v":0},null,null,"Shwegu",{"$f":"SUMIF(Data!$R:$R,$O65,Data!CD:CD)","v":2},{"$f":"SUMIF(Data!$R:$R,$O65,Data!CG:CG)","v":0},{"$f":"SUMIF(Data!$R:$R,$O65,Data!CJ:CJ)","v":1},{"$f":"SUMIF(Data!$R:$R,$O65,Data!CM:CM)","v":49},{"$f":"SUMIF(Data!$R:$R,$O65,Data!CP:CP)","v":1},{"$f":"SUMIF(Data!$R:$R,$O65,Data!CS:CS)","v":0},{"$f":"SUMIF(Data!$R:$R,$O65,Data!CV:CV)","v":1},54,{"$f":"SUMIF(Data!$R:$R,$O65,Data!CE:CE)","v":3},{"$f":"SUMIF(Data!$R:$R,$O65,Data!CH:CH)","v":0},{"$f":"SUMIF(Data!$R:$R,$O65,Data!CK:CK)","v":1},{"$f":"SUMIF(Data!$R:$R,$O65,Data!CN:CN)","v":61},{"$f":"SUMIF(Data!$R:$R,$O65,Data!CQ:CQ)","v":0},{"$f":"SUMIF(Data!$R:$R,$O65,Data!CT:CT)","v":0},{"$f":"SUMIF(Data!$R:$R,$O65,Data!CW:CW)","v":6},{"$f":"SUMIF(Data!$R:$R,$O65,Data!CY:CY)","v":6},{"$f":"SUMIF(Data!$R:$R,$O65,Data!CZ:CZ)","v":17},94]
[null,"Shan (North)",{"$f":"COUNTIF(Data!Q:Q,B66)","v":16},{"$f":"I67","v":16},{"$f":"J67","v":8},{"$f":"K67","v":8},null,"Mongmao",{"$f":"COUNTIF(Data!R:R,H66)","v":0},{"$f":"COUNTIFS(Data!R:R,'Analysis Tables'!H66,Data!Y:Y,'Analysis Tables'!$J$42)","v":0},{"$f":"COUNTIFS(Data!R:R,'Analysis Tables'!H66,Data!Y:Y,'Analysis Tables'!$K$42)","v":0},{"$f":"COUNTIFS(Data!R:R,'Analysis Tables'!H66,Data!Y:Y,'Analysis Tables'!$L$42)","v":0},null,null,"Injangyang",{"$f":"SUMIF(Data!$R:$R,$O66,Data!CD:CD)","v":0},{"$f":"SUMIF(Data!$R:$R,$O66,Data!CG:CG)","v":0},{"$f":"SUMIF(Data!$R:$R,$O66,Data!CJ:CJ)","v":0},{"$f":"SUMIF(Data!$R:$R,$O66,Data!CM:CM)","v":0},{"$f":"SUMIF(Data!$R:$R,$O66,Data!CP:CP)","v":0},{"$f":"SUMIF(Data!$R:$R,$O66,Data!CS:CS)","v":0},{"$f":"SUMIF(Data!$R:$R,$O66,Data!CV:CV)","v":0},0,{"$f":"SUMIF(Data!$R:$R,$O66,Data!CE:CE)","v":0},{"$f":"SUMIF(Data!$R:$R,$O66,Data!CH:CH)","v":0},{"$f":"SUMIF(Data!$R:$R,$O66,Data!CK:CK)","v":0},{"$f":"SUMIF(Data!$R:$R,$O66,Data!CN:CN)","v":0},{"$f":"SUMIF(Data!$R:$R,$O66,Data!CQ:CQ)","v":0},{"$f":"SUMIF(Data!$R:$R,$O66,Data!CT:CT)","v":0},{"$f":"SUMIF(Data!$R:$R,$O66,Data!CW:CW)","v":0},{"$f":"SUMIF(Data!$R:$R,$O66,Data!CY:CY)","v":0},{"$f":"SUMIF(Data!$R:$R,$O66,Data!CZ:CZ)","v":0},0]
[null,"TOTALS",{"$f":"SUM(C65:C66)","v":126},{"$f":"SUM(D65:D66)","v":74},{"$f":"SUM(E65:E66)","v":49},{"$f":"SUM(F65:F66)","v":13},null,"TOTALS",{"$f":"SUM(I43:I66)","v":16},{"$f":"SUM(J43:J66)","v":8},{"$f":"SUM(K43:K66)","v":8},{"$f":"SUM(L43:L66)","v":0},null,null,"Tanai",{"$f":"SUMIF(Data!$R:$R,$O67,Data!CD:CD)","v":0},{"$f":"SUMIF(Data!$R:$R,$O67,Data!CG:CG)","v":0},{"$f":"SUMIF(Data!$R:$R,$O67,Data!CJ:CJ)","v":0},{"$f":"SUMIF(Data!$R:$R,$O67,Data!CM:CM)","v":0},{"$f":"SUMIF(Data!$R:$R,$O67,Data!CP:CP)","v":0},{"$f":"SUMIF(Data!$R:$R,$O67,Data!CS:CS)","v":0},{"$f":"SUMIF(Data!$R:$R,$O67,Data!CV:CV)","v":0},0,{"$f":"SUMIF(Data!$R:$R,$O67,Data!CE:CE)","v":0},{"$f":"SUMIF(Data!$R:$R,$O67,Data!CH:CH)","v":0},{"$f":"SUMIF(Data!$R:$R,$O67,Data!CK:CK)","v":0},{"$f":"SUMIF(Data!$R:$R,$O67,Data!CN:CN)","v":0},{"$f":"SUMIF(Data!$R:$R,$O67,Data!CQ:CQ)","v":0},{"$f":"SUMIF(Data!$R:$R,$O67,Data!CT:CT)","v":0},{"$f":"SUMIF(Data!$R:$R,$O67,Data!CW:CW)","v":0},{"$f":"SUMIF(Data!$R:$R,$O67,Data!CY:CY)","v":0},{"$f":"SUMIF(Data!$R:$R,$O67,Data!CZ:CZ)","v":0},0]
[null,null,null,null,null,null,null,null,null,null,null,null,null,null,"Bhamo",{"$f":"SUMIF(Data!$R:$R,$O68,Data!CD:CD)","v":9},{"$f":"SUMIF(Data!$R:$R,$O68,Data!CG:CG)","v":4},{"$f":"SUMIF(Data!$R:$R,$O68,Data!CJ:CJ)","v":5},{"$f":"SUMIF(Data!$R:$R,$O68,Data!CM:CM)","v":23},{"$f":"SUMIF(Data!$R:$R,$O68,Data!CP:CP)","v":30},{"$f":"SUMIF(Data!$R:$R,$O68,Data!CS:CS)","v":4},{"$f":"SUMIF(Data!$R:$R,$O68,Data!CV:CV)","v":6},81,{"$f":"SUMIF(Data!$R:$R,$O68,Data!CE:CE)","v":10},{"$f":"SUMIF(Data!$R:$R,$O68,Data!CH:CH)","v":3},{"$f":"SUMIF(Data!$R:$R,$O68,Data!CK:CK)","v":9},{"$f":"SUMIF(Data!$R:$R,$O68,Data!CN:CN)","v":21},{"$f":"SUMIF(Data!$R:$R,$O68,Data!CQ:CQ)","v":27},{"$f":"SUMIF(Data!$R:$R,$O68,Data!CT:CT)","v":10},{"$f":"SUMIF(Data!$R:$R,$O68,Data!CW:CW)","v":30},{"$f":"SUMIF(Data!$R:$R,$O68,Data!CY:CY)","v":22},{"$f":"SUMIF(Data!$R:$R,$O68,Data!CZ:CZ)","v":178},310]
[null,null,null,null,null,null,null,null,null,null,null,null,null,null,"Mohnyin",{"$f":"SUMIF(Data!$R:$R,$O69,Data!CD:CD)","v":1},{"$f":"SUMIF(Data!$R:$R,$O69,Data!CG:CG)","v":0},{"$f":"SUMIF(Data!$R:$R,$O69,Data!CJ:CJ)","v":0},{"$f":"SUMIF(Data!$R:$R,$O69,Data!CM:CM)","v":2},{"$f":"SUMIF(Data!$R:$R,$O69,Data!CP:CP)","v":0},{"$f":"SUMIF(Data!$R:$R,$O69,Data!CS:CS)","v":1},{"$f":"SUMIF(Data!$R:$R,$O69,Data!CV:CV)","v":0},4,{"$f":"SUMIF(Data!$R:$R,$O69,Data!CE:CE)","v":1},{"$f":"SUMIF(Data!$R:$R,$O69,Data!CH:CH)","v":0},{"$f":"SUMIF(Data!$R:$R,$O69,Data!CK:CK)","v":1},{"$f":"SUMIF(Data!$R:$R,$O69,Data!CN:CN)","v":1},{"$f":"SUMIF(Data!$R:$R,$O69,Data!CQ:CQ)","v":1},{"$f":"SUMIF(Data!$R:$R,$O69,Data!CT:CT)","v":1},{"$f":"SUMIF(Data!$R:$R,$O69,Data!CW:CW)","v":3},{"$f":"SUMIF(Data!$R:$R,$O69,Data!CY:CY)","v":2},{"$f":"SUMIF(Data!$R:$R,$O69,Data!CZ:CZ)","v":1},11]
[null,null,null,null,null,null,null,null,null,null,null,null,null,null,"Waingmaw",{"$f":"SUMIF(Data!$R:$R,$O70,Data!CD:CD)","v":109},{"$f":"SUMIF(Data!$R:$R,$O70,Data!CG:CG)","v":15},{"$f":"SUMIF(Data!$R:$R,$O70,Data!CJ:CJ)","v":127},{"$f":"SUMIF(Data!$R:$R,$O70,Data!CM:CM)","v":46},{"$f":"SUMIF(Data!$R:$R,$O70,Data!CP:CP)","v":39},{"$f":"SUMIF(Data!$R:$R,$O70,Data!CS:CS)","v":13},{"$f":"SUMIF(Data!$R:$R,$O70,Data!CV:CV)","v":59},408,{"$f":"SUMIF(Data!$R:$R,$O70,Data!CE:CE)","v":68},{"$f":"SUMIF(Data!$R:$R,$O70,Data!CH:CH)","v":9},{"$f":"SUMIF(Data!$R:$R,$O70,Data!CK:CK)","v":139},{"$f":"SUMIF(Data!$R:$R,$O70,Data!CN:CN)","v":59},{"$f":"SUMIF(Data!$R:$R,$O70,Data!CQ:CQ)","v":30},{"$f":"SUMIF(Data!$R:$R,$O70,Data!CT:CT)","v":32},{"$f":"SUMIF(Data!$R:$R,$O70,Data!CW:CW)","v":240},{"$f":"SUMIF(Data!$R:$R,$O70,Data!CY:CY)","v":227},{"$f":"SUMIF(Data!$R:$R,$O70,Data!CZ:CZ)","v":465},1269]
[null,null,null,null,null,null,null,null,null,null,null,null,null,null,"Tsawlaw",{"$f":"SUMIF(Data!$R:$R,$O71,Data!CD:CD)","v":0},{"$f":"SUMIF(Data!$R:$R,$O71,Data!CG:CG)","v":0},{"$f":"SUMIF(Data!$R:$R,$O71,Data!CJ:CJ)","v":0},{"$f":"SUMIF(Data!$R:$R,$O71,Data!CM:CM)","v":0},{"$f":"SUMIF(Data!$R:$R,$O71,Data!CP:CP)","v":0},{"$f":"SUMIF(Data!$R:$R,$O71,Data!CS:CS)","v":0},{"$f":"SUMIF(Data!$R:$R,$O71,Data!CV:CV)","v":0},0,{"$f":"SUMIF(Data!$R:$R,$O71,Data!CE:CE)","v":0},{"$f":"SUMIF(Data!$R:$R,$O71,Data!CH:CH)","v":0},{"$f":"SUMIF(Data!$R:$R,$O71,Data!CK:CK)","v":0},{"$f":"SUMIF(Data!$R:$R,$O71,Data!CN:CN)","v":0},{"$f":"SUMIF(Data!$R:$R,$O71,Data!CQ:CQ)","v":0},{"$f":"SUMIF(Data!$R:$R,$O71,Data!CT:CT)","v":0},{"$f":"SUMIF(Data!$R:$R,$O71,Data!CW:CW)","v":0},{"$f":"SUMIF(Data!$R:$R,$O71,Data!CY:CY)","v":0},{"$f":"SUMIF(Data!$R:$R,$O71,Data!CZ:CZ)","v":0},0]
[null,null,null,null,null,null,null,null,null,null,null,null,null,null,"Machanbaw",{"$f":"SUMIF(Data!$R:$R,$O72,Data!CD:CD)","v":0},{"$f":"SUMIF(Data!$R:$R,$O72,Data!CG:CG)","v":0},{"$f":"SUMIF(Data!$R:$R,$O72,Data!CJ:CJ)","v":0},{"$f":"SUMIF(Data!$R:$R,$O72,Data!CM:CM)","v":0},{"$f":"SUMIF(Data!$R:$R,$O72,Data!CP:CP)","v":0},{"$f":"SUMIF(Data!$R:$R,$O72,Data!CS:CS)","v":0},{"$f":"SUMIF(Data!$R:$R,$O72,Data!CV:CV)","v":0},0,{"$f":"SUMIF(Data!$R:$R,$O72,Data!CE:CE)","v":0},{"$f":"SUMIF(Data!$R:$R,$O72,Data!CH:CH)","v":0},{"$f":"SUMIF(Data!$R:$R,$O72,Data!CK:CK)","v":0},{"$f":"SUMIF(Data!$R:$R,$O72,Data!CN:CN)","v":0},{"$f":"SUMIF(Data!$R:$R,$O72,Data!CQ:CQ)","v":0},{"$f":"SUMIF(Data!$R:$R,$O72,Data!CT:CT)","v":0},{"$f":"SUMIF(Data!$R:$R,$O72,Data!CW:CW)","v":0},{"$f":"SUMIF(Data!$R:$R,$O72,Data!CY:CY)","v":0},{"$f":"SUMIF(Data!$R:$R,$O72,Data!CZ:CZ)","v":0},0]
[null,null,null,null,null,null,null,null,null,null,null,null,null,null,"Hpakant",{"$f":"SUMIF(Data!$R:$R,$O73,Data!CD:CD)","v":13},{"$f":"SUMIF(Data!$R:$R,$O73,Data!CG:CG)","v":5},{"$f":"SUMIF(Data!$R:$R,$O73,Data!CJ:CJ)","v":19},{"$f":"SUMIF(Data!$R:$R,$O73,Data!CM:CM)","v":6},{"$f":"SUMIF(Data!$R:$R,$O73,Data!CP:CP)","v":7},{"$f":"SUMIF(Data!$R:$R,$O73,Data!CS:CS)","v":1},{"$f":"SUMIF(Data!$R:$R,$O73,Data!CV:CV)","v":13},64,{"$f":"SUMIF(Data!$R:$R,$O73,Data!CE:CE)","v":12},{"$f":"SUMIF(Data!$R:$R,$O73,Data!CH:CH)","v":4},{"$f":"SUMIF(Data!$R:$R,$O73,Data!CK:CK)","v":12},{"$f":"SUMIF(Data!$R:$R,$O73,Data!CN:CN)","v":2},{"$f":"SUMIF(Data!$R:$R,$O73,Data!CQ:CQ)","v":2},{"$f":"SUMIF(Data!$R:$R,$O73,Data!CT:CT)","v":4},{"$f":"SUMIF(Data!$R:$R,$O73,Data!CW:CW)","v":54},{"$f":"SUMIF(Data!$R:$R,$O73,Data!CY:CY)","v":26},{"$f":"SUMIF(Data!$R:$R,$O73,Data!CZ:CZ)","v":110},226]
[null,null,null,null,null,null,null,null,null,null,null,null,null,null,"TOTALS",{"$f":"SUM(P56:P73)","v":290},{"$f":"SUM(Q56:Q73)","v":130},251,203,681,84,234,1873,{"$f":"SUM(X56:X73)","v":187},81,278,221,753,166,1234,655,1641,5216]
[null,null,null,null,null,null,null,null,null,null,null,null,null,"Shan (North)","Namphan",{"$f":"SUMIF(Data!$R:$R,$O75,Data!CD:CD)","v":0},{"$f":"SUMIF(Data!$R:$R,$O75,Data!CG:CG)","v":0},{"$f":"SUMIF(Data!$R:$R,$O75,Data!CJ:CJ)","v":0},{"$f":"SUMIF(Data!$R:$R,$O75,Data!CM:CM)","v":0},{"$f":"SUMIF(Data!$R:$R,$O75,Data!CP:CP)","v":0},{"$f":"SUMIF(Data!$R:$R,$O75,Data!CS:CS)","v":0},{"$f":"SUMIF(Data!$R:$R,$O75,Data!CV:CV)","v":0},{"$f":"SUM(P75:V75)","v":0},{"$f":"SUMIF(Data!$R:$R,$O75,Data!CE:CE)","v":0},{"$f":"SUMIF(Data!$R:$R,$O75,Data!CH:CH)","v":0},{"$f":"SUMIF(Data!$R:$R,$O75,Data!CK:CK)","v":0},{"$f":"SUMIF(Data!$R:$R,$O75,Data!CN:CN)","v":0},{"$f":"SUMIF(Data!$R:$R,$O75,Data!CQ:CQ)","v":0},{"$f":"SUMIF(Data!$R:$R,$O75,Data!CT:CT)","v":0},{"$f":"SUMIF(Data!$R:$R,$O75,Data!CW:CW)","v":0},{"$f":"SUMIF(Data!$R:$R,$O75,Data!CY:CY)","v":0},{"$f":"SUMIF(Data!$R:$R,$O75,Data!CZ:CZ)","v":0},0]
[null,null,null,null,null,null,null,null,null,null,null,null,null,null,"Nawnghkio",{"$f":"SUMIF(Data!$R:$R,$O76,Data!CD:CD)","v":0},{"$f":"SUMIF(Data!$R:$R,$O76,Data!CG:CG)","v":0},{"$f":"SUMIF(Data!$R:$R,$O76,Data!CJ:CJ)","v":0},{"$f":"SUMIF(Data!$R:$R,$O76,Data!CM:CM)","v":0},{"$f":"SUMIF(Data!$R:$R,$O76,Data!CP:CP)","v":0},{"$f":"SUMIF(Data!$R:$R,$O76,Data!CS:CS)","v":0},{"$f":"SUMIF(Data!$R:$R,$O76,Data!CV:CV)","v":0},{"$f":"SUM(P76:V76)","v":0},{"$f":"SUMIF(Data!$R:$R,$O76,Data!CE:CE)","v":0},{"$f":"SUMIF(Data!$R:$R,$O76,Data!CH:CH)","v":0},{"$f":"SUMIF(Data!$R:$R,$O76,Data!CK:CK)","v":0},{"$f":"SUMIF(Data!$R:$R,$O76,Data!CN:CN)","v":0},{"$f":"SUMIF(Data!$R:$R,$O76,Data!CQ:CQ)","v":0},{"$f":"SUMIF(Data!$R:$R,$O76,Data!CT:CT)","v":0},{"$f":"SUMIF(Data!$R:$R,$O76,Data!CW:CW)","v":0},{"$f":"SUMIF(Data!$R:$R,$O76,Data!CY:CY)","v":0},{"$f":"SUMIF(Data!$R:$R,$O76,Data!CZ:CZ)","v":0},0]
[null,null,null,null,null,null,null,null,null,null,null,null,null,null,"Mongyai",{"$f":"SUMIF(Data!$R:$R,$O77,Data!CD:CD)","v":0},{"$f":"SUMIF(Data!$R:$R,$O77,Data!CG:CG)","v":0},{"$f":"SUMIF(Data!$R:$R,$O77,Data!CJ:CJ)","v":0},{"$f":"SUMIF(Data!$R:$R,$O77,Data!CM:CM)","v":0},{"$f":"SUMIF(Data!$R:$R,$O77,Data!CP:CP)","v":0},{"$f":"SUMIF(Data!$R:$R,$O77,Data!CS:CS)","v":0},{"$f":"SUMIF(Data!$R:$R,$O77,Data!CV:CV)","v":0},0,{"$f":"SUMIF(Data!$R:$R,$O77,Data!CE:CE)","v":0},{"$f":"SUMIF(Data!$R:$R,$O77,Data!CH:CH)","v":0},{"$f":"SUMIF(Data!$R:$R,$O77,Data!CK:CK)","v":0},{"$f":"SUMIF(Data!$R:$R,$O77,Data!CN:CN)","v":0},{"$f":"SUMIF(Data!$R:$R,$O77,Data!CQ:CQ)","v":0},{"$f":"SUMIF(Data!$R:$R,$O77,Data!CT:CT)","v":0},{"$f":"SUMIF(Data!$R:$R,$O77,Data!CW:CW)","v":0},{"$f":"SUMIF(Data!$R:$R,$O77,Data!CY:CY)","v":0},{"$f":"SUMIF(Data!$R:$R,$O77,Data!CZ:CZ)","v":0},0]
[null,null,null,null,null,null,null,null,null,null,null,null,null,null,"Namhsan",{"$f":"SUMIF(Data!$R:$R,$O78,Data!CD:CD)","v":0},{"$f":"SUMIF(Data!$R:$R,$O78,Data!CG:CG)","v":0},{"$f":"SUMIF(Data!$R:$R,$O78,Data!CJ:CJ)","v":0},{"$f":"SUMIF(Data!$R:$R,$O78,Data!CM:CM)","v":0},{"$f":"SUMIF(Data!$R:$R,$O78,Data!CP:CP)","v":0},{"$f":"SUMIF(Data!$R:$R,$O78,Data!CS:CS)","v":0},{"$f":"SUMIF(Data!$R:$R,$O78,Data!CV:CV)","v":0},0,{"$f":"SUMIF(Data!$R:$R,$O78,Data!CE:CE)","v":0},{"$f":"SUMIF(Data!$R:$R,$O78,Data!CH:CH)","v":0},{"$f":"SUMIF(Data!$R:$R,$O78,Data!CK:CK)","v":0},{"$f":"SUMIF(Data!$R:$R,$O78,Data!CN:CN)","v":0},{"$f":"SUMIF(Data!$R:$R,$O78,Data!CQ:CQ)","v":0},{"$f":"SUMIF(Data!$R:$R,$O78,Data!CT:CT)","v":0},{"$f":"SUMIF(Data!$R:$R,$O78,Data!CW:CW)","v":0},{"$f":"SUMIF(Data!$R:$R,$O78,Data!CY:CY)","v":0},{"$f":"SUMIF(Data!$R:$R,$O78,Data!CZ:CZ)","v":0},0]
[null,null,null,null,null,null,null,null,null,null,null,null,null,null,"Hseni",{"$f":"SUMIF(Data!$R:$R,$O79,Data!CD:CD)","v":0},{"$f":"SUMIF(Data!$R:$R,$O79,Data!CG:CG)","v":0},{"$f":"SUMIF(Data!$R:$R,$O79,Data!CJ:CJ)","v":0},{"$f":"SUMIF(Data!$R:$R,$O79,Data!CM:CM)","v":0},{"$f":"SUMIF(Data!$R:$R,$O79,Data!CP:CP)","v":0},{"$f":"SUMIF(Data!$R:$R,$O79,Data!CS:CS)","v":1},{"$f":"SUMIF(Data!$R:$R,$O79,Data!CV:CV)","v":0},1,{"$f":"SUMIF(Data!$R:$R,$O79,Data!CE:CE)","v":0},{"$f":"SUMIF(Data!$R:$R,$O79,Data!CH:CH)","v":0},{"$f":"SUMIF(Data!$R:$R,$O79,Data!CK:CK)","v":2},{"$f":"SUMIF(Data!$R:$R,$O79,Data!CN:CN)","v":0},{"$f":"SUMIF(Data!$R:$R,$O79,Data!CQ:CQ)","v":0},{"$f":"SUMIF(Data!$R:$R,$O79,Data!CT:CT)","v":1},{"$f":"SUMIF(Data!$R:$R,$O79,Data!CW:CW)","v":0},{"$f":"SUMIF(Data!$R:$R,$O79,Data!CY:CY)","v":3},{"$f":"SUMIF(Data!$R:$R,$O79,Data!CZ:CZ)","v":6},12]
[null,null,null,null,null,null,null,null,null,null,null,null,null,null,"Laukkaing",{"$f":"SUMIF(Data!$R:$R,$O80,Data!CD:CD)","v":0},{"$f":"SUMIF(Data!$R:$R,$O80,Data!CG:CG)","v":0},{"$f":"SUMIF(Data!$R:$R,$O80,Data!CJ:CJ)","v":0},{"$f":"SUMIF(Data!$R:$R,$O80,Data!CM:CM)","v":0},{"$f":"SUMIF(Data!$R:$R,$O80,Data!CP:CP)","v":0},{"$f":"SUMIF(Data!$R:$R,$O80,Data!CS:CS)","v":0},{"$f":"SUMIF(Data!$R:$R,$O80,Data!CV:CV)","v":0},0,{"$f":"SUMIF(Data!$R:$R,$O80,Data!CE:CE)","v":0},{"$f":"SUMIF(Data!$R:$R,$O80,Data!CH:CH)","v":0},{"$f":"SUMIF(Data!$R:$R,$O80,Data!CK:CK)","v":0},{"$f":"SUMIF(Data!$R:$R,$O80,Data!CN:CN)","v":0},{"$f":"SUMIF(Data!$R:$R,$O80,Data!CQ:CQ)","v":0},{"$f":"SUMIF(Data!$R:$R,$O80,Data!CT:CT)","v":0},{"$f":"SUMIF(Data!$R:$R,$O80,Data!CW:CW)","v":0},{"$f":"SUMIF(Data!$R:$R,$O80,Data!CY:CY)","v":0},{"$f":"SUMIF(Data!$R:$R,$O80,Data!CZ:CZ)","v":0},0]
[null,null,null,null,null,null,null,null,null,null,null,null,null,null,"Muse",{"$f":"SUMIF(Data!$R:$R,$O81,Data!CD:CD)","v":0},{"$f":"SUMIF(Data!$R:$R,$O81,Data!CG:CG)","v":1},{"$f":"SUMIF(Data!$R:$R,$O81,Data!CJ:CJ)","v":1},{"$f":"SUMIF(Data!$R:$R,$O81,Data!CM:CM)","v":0},{"$f":"SUMIF(Data!$R:$R,$O81,Data!CP:CP)","v":0},{"$f":"SUMIF(Data!$R:$R,$O81,Data!CS:CS)","v":0},{"$f":"SUMIF(Data!$R:$R,$O81,Data!CV:CV)","v":0},2,{"$f":"SUMIF(Data!$R:$R,$O81,Data!CE:CE)","v":1},{"$f":"SUMIF(Data!$R:$R,$O81,Data!CH:CH)","v":0},{"$f":"SUMIF(Data!$R:$R,$O81,Data!CK:CK)","v":2},{"$f":"SUMIF(Data!$R:$R,$O81,Data!CN:CN)","v":0},{"$f":"SUMIF(Data!$R:$R,$O81,Data!CQ:CQ)","v":0},{"$f":"SUMIF(Data!$R:$R,$O81,Data!CT:CT)","v":0},{"$f":"SUMIF(Data!$R:$R,$O81,Data!CW:CW)","v":6},{"$f":"SUMIF(Data!$R:$R,$O81,Data!CY:CY)","v":2},{"$f":"SUMIF(Data!$R:$R,$O81,Data!CZ:CZ)","v":3},14]
[null,null,null,null,null,null,null,null,null,null,null,null,null,null,"Mabein",{"$f":"SUMIF(Data!$R:$R,$O82,Data!CD:CD)","v":0},{"$f":"SUMIF(Data!$R:$R,$O82,Data!CG:CG)","v":0},{"$f":"SUMIF(Data!$R:$R,$O82,Data!CJ:CJ)","v":0},{"$f":"SUMIF(Data!$R:$R,$O82,Data!CM:CM)","v":0},{"$f":"SUMIF(Data!$R:$R,$O82,Data!CP:CP)","v":0},{"$f":"SUMIF(Data!$R:$R,$O82,Data!CS:CS)","v":0},{"$f":"SUMIF(Data!$R:$R,$O82,Data!CV:CV)","v":0},0,{"$f":"SUMIF(Data!$R:$R,$O82,Data!CE:CE)","v":0},{"$f":"SUMIF(Data!$R:$R,$O82,Data!CH:CH)","v":0},{"$f":"SUMIF(Data!$R:$R,$O82,Data!CK:CK)","v":0},{"$f":"SUMIF(Data!$R:$R,$O82,Data!CN:CN)","v":0},{"$f":"SUMIF(Data!$R:$R,$O82,Data!CQ:CQ)","v":0},{"$f":"SUMIF(Data!$R:$R,$O82,Data!CT:CT)","v":0},{"$f":"SUMIF(Data!$R:$R,$O82,Data!CW:CW)","v":0},{"$f":"SUMIF(Data!$R:$R,$O82,Data!CY:CY)","v":0},{"$f":"SUMIF(Data!$R:$R,$O82,Data!CZ:CZ)","v":0},0]
[null,null,null,null,null,null,null,null,null,null,null,null,null,null,"Kyaukme",{"$f":"SUMIF(Data!$R:$R,$O83,Data!CD:CD)","v":0},{"$f":"SUMIF(Data!$R:$R,$O83,Data!CG:CG)","v":0},{"$f":"SUMIF(Data!$R:$R,$O83,Data!CJ:CJ)","v":0},{"$f":"SUMIF(Data!$R:$R,$O83,Data!CM:CM)","v":0},{"$f":"SUMIF(Data!$R:$R,$O83,Data!CP:CP)","v":0},{"$f":"SUMIF(Data!$R:$R,$O83,Data!CS:CS)","v":0},{"$f":"SUMIF(Data!$R:$R,$O83,Data!CV:CV)","v":0},0,{"$f":"SUMIF(Data!$R:$R,$O83,Data!CE:CE)","v":0},{"$f":"SUMIF(Data!$R:$R,$O83,Data!CH:CH)","v":0},{"$f":"SUMIF(Data!$R:$R,$O83,Data!CK:CK)","v":0},{"$f":"SUMIF(Data!$R:$R,$O83,Data!CN:CN)","v":0},{"$f":"SUMIF(Data!$R:$R,$O83,Data!CQ:CQ)","v":0},{"$f":"SUMIF(Data!$R:$R,$O83,Data!CT:CT)","v":0},{"$f":"SUMIF(Data!$R:$R,$O83,Data!CW:CW)","v":0},{"$f":"SUMIF(Data!$R:$R,$O83,Data!CY:CY)","v":0},{"$f":"SUMIF(Data!$R:$R,$O83,Data!CZ:CZ)","v":0},0]
[null,null,null,null,null,null,null,null,null,null,null,null,null,null,"Lashio",{"$f":"SUMIF(Data!$R:$R,$O84,Data!CD:CD)","v":0},{"$f":"SUMIF(Data!$R:$R,$O84,Data!CG:CG)","v":0},{"$f":"SUMIF(Data!$R:$R,$O84,Data!CJ:CJ)","v":0},{"$f":"SUMIF(Data!$R:$R,$O84,Data!CM:CM)","v":0},{"$f":"SUMIF(Data!$R:$R,$O84,Data!CP:CP)","v":0},{"$f":"SUMIF(Data!$R:$R,$O84,Data!CS:CS)","v":0},{"$f":"SUMIF(Data!$R:$R,$O84,Data!CV:CV)","v":0},0,{"$f":"SUMIF(Data!$R:$R,$O84,Data!CE:CE)","v":0},{"$f":"SUMIF(Data!$R:$R,$O84,Data!CH:CH)","v":0},{"$f":"SUMIF(Data!$R:$R,$O84,Data!CK:CK)","v":0},{"$f":"SUMIF(Data!$R:$R,$O84,Data!CN:CN)","v":0},{"$f":"SUMIF(Data!$R:$R,$O84,Data!CQ:CQ)","v":0},{"$f":"SUMIF(Data!$R:$R,$O84,Data!CT:CT)","v":0},{"$f":"SUMIF(Data!$R:$R,$O84,Data!CW:CW)","v":0},{"$f":"SUMIF(Data!$R:$R,$O84,Data!CY:CY)","v":0},{"$f":"SUMIF(Data!$R:$R,$O84,Data!CZ:CZ)","v":0},0]
[null,null,null,null,null,null,null,null,null,null,null,null,null,null,"Kunlong",{"$f":"SUMIF(Data!$R:$R,$O85,Data!CD:CD)","v":0},{"$f":"SUMIF(Data!$R:$R,$O85,Data!CG:CG)","v":0},{"$f":"SUMIF(Data!$R:$R,$O85,Data!CJ:CJ)","v":0},{"$f":"SUMIF(Data!$R:$R,$O85,Data!CM:CM)","v":0},{"$f":"SUMIF(Data!$R:$R,$O85,Data!CP:CP)","v":0},{"$f":"SUMIF(Data!$R:$R,$O85,Data!CS:CS)","v":0},{"$f":"SUMIF(Data!$R:$R,$O85,Data!CV:CV)","v":0},0,{"$f":"SUMIF(Data!$R:$R,$O85,Data!CE:CE)","v":0},{"$f":"SUMIF(Data!$R:$R,$O85,Data!CH:CH)","v":0},{"$f":"SUMIF(Data!$R:$R,$O85,Data!CK:CK)","v":0},{"$f":"SUMIF(Data!$R:$R,$O85,Data!CN:CN)","v":0},{"$f":"SUMIF(Data!$R:$R,$O85,Data!CQ:CQ)","v":0},{"$f":"SUMIF(Data!$R:$R,$O85,Data!CT:CT)","v":0},{"$f":"SUMIF(Data!$R:$R,$O85,Data!CW:CW)","v":0},{"$f":"SUMIF(Data!$R:$R,$O85,Data!CY:CY)","v":0},{"$f":"SUMIF(Data!$R:$R,$O85,Data!CZ:CZ)","v":0},0]
[null,null,null,null,null,null,null,null,null,null,null,null,null,null,"Matman",{"$f":"SUMIF(Data!$R:$R,$O86,Data!CD:CD)","v":0},{"$f":"SUMIF(Data!$R:$R,$O86,Data!CG:CG)","v":0},{"$f":"SUMIF(Data!$R:$R,$O86,Data!CJ:CJ)","v":0},{"$f":"SUMIF(Data!$R:$R,$O86,Data!CM:CM)","v":0},{"$f":"SUMIF(Data!$R:$R,$O86,Data!CP:CP)","v":0},{"$f":"SUMIF(Data!$R:$R,$O86,Data!CS:CS)","v":0},{"$f":"SUMIF(Data!$R:$R,$O86,Data!CV:CV)","v":0},0,{"$f":"SUMIF(Data!$R:$R,$O86,Data!CE:CE)","v":0},{"$f":"SUMIF(Data!$R:$R,$O86,Data!CH:CH)","v":0},{"$f":"SUMIF(Data!$R:$R,$O86,Data!CK:CK)","v":0},{"$f":"SUMIF(Data!$R:$R,$O86,Data!CN:CN)","v":0},{"$f":"SUMIF(Data!$R:$R,$O86,Data!CQ:CQ)","v":0},{"$f":"SUMIF(Data!$R:$R,$O86,Data!CT:CT)","v":0},{"$f":"SUMIF(Data!$R:$R,$O86,Data!CW:CW)","v":0},{"$f":"SUMIF(Data!$R:$R,$O86,Data!CY:CY)","v":0},{"$f":"SUMIF(Data!$R:$R,$O86,Data!CZ:CZ)","v":0},0]
[null,null,null,null,null,null,null,null,null,null,null,null,null,null,"Namtu",{"$f":"SUMIF(Data!$R:$R,$O87,Data!CD:CD)","v":0},{"$f":"SUMIF(Data!$R:$R,$O87,Data!CG:CG)","v":0},{"$f":"SUMIF(Data!$R:$R,$O87,Data!CJ:CJ)","v":0},{"$f":"SUMIF(Data!$R:$R,$O87,Data!CM:CM)","v":0},{"$f":"SUMIF(Data!$R:$R,$O87,Data!CP:CP)","v":0},{"$f":"SUMIF(Data!$R:$R,$O87,Data!CS:CS)","v":0},{"$f":"SUMIF(Data!$R:$R,$O87,Data!CV:CV)","v":0},0,{"$f":"SUMIF(Data!$R:$R,$O87,Data!CE:CE)","v":1},{"$f":"SUMIF(Data!$R:$R,$O87,Data!CH:CH)","v":0},{"$f":"SUMIF(Data!$R:$R,$O87,Data!CK:CK)","v":0},{"$f":"SUMIF(Data!$R:$R,$O87,Data!CN:CN)","v":0},{"$f":"SUMIF(Data!$R:$R,$O87,Data!CQ:CQ)","v":0},{"$f":"SUMIF(Data!$R:$R,$O87,Data!CT:CT)","v":0},{"$f":"SUMIF(Data!$R:$R,$O87,Data!CW:CW)","v":0},{"$f":"SUMIF(Data!$R:$R,$O87,Data!CY:CY)","v":0},{"$f":"SUMIF(Data!$R:$R,$O87,Data!CZ:CZ)","v":8},9]
[null,null,null,null,null,null,null,null,null,null,null,null,null,null,"Mongmit",{"$f":"SUMIF(Data!$R:$R,$O88,Data!CD:CD)","v":0},{"$f":"SUMIF(Data!$R:$R,$O88,Data!CG:CG)","v":0},{"$f":"SUMIF(Data!$R:$R,$O88,Data!CJ:CJ)","v":0},{"$f":"SUMIF(Data!$R:$R,$O88,Data!CM:CM)","v":0},{"$f":"SUMIF(Data!$R:$R,$O88,Data!CP:CP)","v":0},{"$f":"SUMIF(Data!$R:$R,$O88,Data!CS:CS)","v":0},{"$f":"SUMIF(Data!$R:$R,$O88,Data!CV:CV)","v":0},0,{"$f":"SUMIF(Data!$R:$R,$O88,Data!CE:CE)","v":0},{"$f":"SUMIF(Data!$R:$R,$O88,Data!CH:CH)","v":0},{"$f":"SUMIF(Data!$R:$R,$O88,Data!CK:CK)","v":0},{"$f":"SUMIF(Data!$R:$R,$O88,Data!CN:CN)","v":0},{"$f":"SUMIF(Data!$R:$R,$O88,Data!CQ:CQ)","v":0},{"$f":"SUMIF(Data!$R:$R,$O88,Data!CT:CT)","v":0},{"$f":"SUMIF(Data!$R:$R,$O88,Data!CW:CW)","v":0},{"$f":"SUMIF(Data!$R:$R,$O88,Data!CY:CY)","v":0},{"$f":"SUMIF(Data!$R:$R,$O88,Data!CZ:CZ)","v":0},0]
[null,null,null,null,null,null,null,null,null,null,null,null,null,null,"Kutkai",{"$f":"SUMIF(Data!$R:$R,$O89,Data!CD:CD)","v":8},{"$f":"SUMIF(Data!$R:$R,$O89,Data!CG:CG)","v":0},{"$f":"SUMIF(Data!$R:$R,$O89,Data!CJ:CJ)","v":12},{"$f":"SUMIF(Data!$R:$R,$O89,Data!CM:CM)","v":20},{"$f":"SUMIF(Data!$R:$R,$O89,Data!CP:CP)","v":4},{"$f":"SUMIF(Data!$R:$R,$O89,Data!CS:CS)","v":9},{"$f":"SUMIF(Data!$R:$R,$O89,Data!CV:CV)","v":5},58,{"$f":"SUMIF(Data!$R:$R,$O89,Data!CE:CE)","v":5},{"$f":"SUMIF(Data!$R:$R,$O89,Data!CH:CH)","v":2},{"$f":"SUMIF(Data!$R:$R,$O89,Data!CK:CK)","v":10},{"$f":"SUMIF(Data!$R:$R,$O89,Data!CN:CN)","v":34},{"$f":"SUMIF(Data!$R:$R,$O89,Data!CQ:CQ)","v":5},{"$f":"SUMIF(Data!$R:$R,$O89,Data!CT:CT)","v":20},{"$f":"SUMIF(Data!$R:$R,$O89,Data!CW:CW)","v":16},{"$f":"SUMIF(Data!$R:$R,$O89,Data!CY:CY)","v":36},{"$f":"SUMIF(Data!$R:$R,$O89,Data!CZ:CZ)","v":84},212]
[null,null,null,null,null,null,null,null,null,null,null,null,null,null,"Hsipaw",{"$f":"SUMIF(Data!$R:$R,$O90,Data!CD:CD)","v":0},{"$f":"SUMIF(Data!$R:$R,$O90,Data!CG:CG)","v":0},{"$f":"SUMIF(Data!$R:$R,$O90,Data!CJ:CJ)","v":0},{"$f":"SUMIF(Data!$R:$R,$O90,Data!CM:CM)","v":0},{"$f":"SUMIF(Data!$R:$R,$O90,Data!CP:CP)","v":0},{"$f":"SUMIF(Data!$R:$R,$O90,Data!CS:CS)","v":0},{"$f":"SUMIF(Data!$R:$R,$O90,Data!CV:CV)","v":0},0,{"$f":"SUMIF(Data!$R:$R,$O90,Data!CE:CE)","v":0},{"$f":"SUMIF(Data!$R:$R,$O90,Data!CH:CH)","v":0},{"$f":"SUMIF(Data!$R:$R,$O90,Data!CK:CK)","v":0},{"$f":"SUMIF(Data!$R:$R,$O90,Data!CN:CN)","v":0},{"$f":"SUMIF(Data!$R:$R,$O90,Data!CQ:CQ)","v":0},{"$f":"SUMIF(Data!$R:$R,$O90,Data!CT:CT)","v":0},{"$f":"SUMIF(Data!$R:$R,$O90,Data!CW:CW)","v":0},{"$f":"SUMIF(Data!$R:$R,$O90,Data!CY:CY)","v":0},{"$f":"SUMIF(Data!$R:$R,$O90,Data!CZ:CZ)","v":0},0]
[null,null,null,null,null,null,null,null,null,null,null,null,null,null,"Pangsang",{"$f":"SUMIF(Data!$R:$R,$O91,Data!CD:CD)","v":0},{"$f":"SUMIF(Data!$R:$R,$O91,Data!CG:CG)","v":0},{"$f":"SUMIF(Data!$R:$R,$O91,Data!CJ:CJ)","v":0},{"$f":"SUMIF(Data!$R:$R,$O91,Data!CM:CM)","v":0},{"$f":"SUMIF(Data!$R:$R,$O91,Data!CP:CP)","v":0},{"$f":"SUMIF(Data!$R:$R,$O91,Data!CS:CS)","v":0},{"$f":"SUMIF(Data!$R:$R,$O91,Data!CV:CV)","v":0},0,{"$f":"SUMIF(Data!$R:$R,$O91,Data!CE:CE)","v":0},{"$f":"SUMIF(Data!$R:$R,$O91,Data!CH:CH)","v":0},{"$f":"SUMIF(Data!$R:$R,$O91,Data!CK:CK)","v":0},{"$f":"SUMIF(Data!$R:$R,$O91,Data!CN:CN)","v":0},{"$f":"SUMIF(Data!$R:$R,$O91,Data!CQ:CQ)","v":0},{"$f":"SUMIF(Data!$R:$R,$O91,Data!CT:CT)","v":0},{"$f":"SUMIF(Data!$R:$R,$O91,Data!CW:CW)","v":0},{"$f":"SUMIF(Data!$R:$R,$O91,Data!CY:CY)","v":0},{"$f":"SUMIF(Data!$R:$R,$O91,Data!CZ:CZ)","v":0},0]
[null,null,null,null,null,null,null,null,null,null,null,null,null,null,"Pangwaun",{"$f":"SUMIF(Data!$R:$R,$O92,Data!CD:CD)","v":0},{"$f":"SUMIF(Data!$R:$R,$O92,Data!CG:CG)","v":0},{"$f":"SUMIF(Data!$R:$R,$O92,Data!CJ:CJ)","v":0},{"$f":"SUMIF(Data!$R:$R,$O92,Data!CM:CM)","v":0},{"$f":"SUMIF(Data!$R:$R,$O92,Data!CP:CP)","v":0},{"$f":"SUMIF(Data!$R:$R,$O92,Data!CS:CS)","v":0},{"$f":"SUMIF(Data!$R:$R,$O92,Data!CV:CV)","v":0},0,{"$f":"SUMIF(Data!$R:$R,$O92,Data!CE:CE)","v":0},{"$f":"SUMIF(Data!$R:$R,$O92,Data!CH:CH)","v":0},{"$f":"SUMIF(Data!$R:$R,$O92,Data!CK:CK)","v":0},{"$f":"SUMIF(Data!$R:$R,$O92,Data!CN:CN)","v":0},{"$f":"SUMIF(Data!$R:$R,$O92,Data!CQ:CQ)","v":0},{"$f":"SUMIF(Data!$R:$R,$O92,Data!CT:CT)","v":0},{"$f":"SUMIF(Data!$R:$R,$O92,Data!CW:CW)","v":0},{"$f":"SUMIF(Data!$R:$R,$O92,Data!CY:CY)","v":0},{"$f":"SUMIF(Data!$R:$R,$O92,Data!CZ:CZ)","v":0},0]
[null,null,null,null,null,null,null,null,null,null,null,null,null,null,"Hopang",{"$f":"SUMIF(Data!$R:$R,$O93,Data!CD:CD)","v":0},{"$f":"SUMIF(Data!$R:$R,$O93,Data!CG:CG)","v":0},{"$f":"SUMIF(Data!$R:$R,$O93,Data!CJ:CJ)","v":0},{"$f":"SUMIF(Data!$R:$R,$O93,Data!CM:CM)","v":0},{"$f":"SUMIF(Data!$R:$R,$O93,Data!CP:CP)","v":0},{"$f":"SUMIF(Data!$R:$R,$O93,Data!CS:CS)","v":0},{"$f":"SUMIF(Data!$R:$R,$O93,Data!CV:CV)","v":0},0,{"$f":"SUMIF(Data!$R:$R,$O93,Data!CE:CE)","v":0},{"$f":"SUMIF(Data!$R:$R,$O93,Data!CH:CH)","v":0},{"$f":"SUMIF(Data!$R:$R,$O93,Data!CK:CK)","v":0},{"$f":"SUMIF(Data!$R:$R,$O93,Data!CN:CN)","v":0},{"$f":"SUMIF(Data!$R:$R,$O93,Data!CQ:CQ)","v":0},{"$f":"SUMIF(Data!$R:$R,$O93,Data!CT:CT)","v":0},{"$f":"SUMIF(Data!$R:$R,$O93,Data!CW:CW)","v":0},{"$f":"SUMIF(Data!$R:$R,$O93,Data!CY:CY)","v":0},{"$f":"SUMIF(Data!$R:$R,$O93,Data!CZ:CZ)","v":0},0]
[null,null,null,null,null,null,null,null,null,null,null,null,null,null,"Manton",{"$f":"SUMIF(Data!$R:$R,$O94,Data!CD:CD)","v":0},{"$f":"SUMIF(Data!$R:$R,$O94,Data!CG:CG)","v":1},{"$f":"SUMIF(Data!$R:$R,$O94,Data!CJ:CJ)","v":0},{"$f":"SUMIF(Data!$R:$R,$O94,Data!CM:CM)","v":0},{"$f":"SUMIF(Data!$R:$R,$O94,Data!CP:CP)","v":1},{"$f":"SUMIF(Data!$R:$R,$O94,Data!CS:CS)","v":0},{"$f":"SUMIF(Data!$R:$R,$O94,Data!CV:CV)","v":1},3,{"$f":"SUMIF(Data!$R:$R,$O94,Data!CE:CE)","v":2},{"$f":"SUMIF(Data!$R:$R,$O94,Data!CH:CH)","v":0},{"$f":"SUMIF(Data!$R:$R,$O94,Data!CK:CK)","v":1},{"$f":"SUMIF(Data!$R:$R,$O94,Data!CN:CN)","v":0},{"$f":"SUMIF(Data!$R:$R,$O94,Data!CQ:CQ)","v":2},{"$f":"SUMIF(Data!$R:$R,$O94,Data!CT:CT)","v":0},{"$f":"SUMIF(Data!$R:$R,$O94,Data!CW:CW)","v":2},{"$f":"SUMIF(Data!$R:$R,$O94,Data!CY:CY)","v":2},{"$f":"SUMIF(Data!$R:$R,$O94,Data!CZ:CZ)","v":5},14]
[null,null,null,null,null,null,null,null,null,null,null,null,null,null,"Konkyan",{"$f":"SUMIF(Data!$R:$R,$O95,Data!CD:CD)","v":0},{"$f":"SUMIF(Data!$R:$R,$O95,Data!CG:CG)","v":0},{"$f":"SUMIF(Data!$R:$R,$O95,Data!CJ:CJ)","v":0},{"$f":"SUMIF(Data!$R:$R,$O95,Data!CM:CM)","v":0},{"$f":"SUMIF(Data!$R:$R,$O95,Data!CP:CP)","v":0},{"$f":"SUMIF(Data!$R:$R,$O95,Data!CS:CS)","v":0},{"$f":"SUMIF(Data!$R:$R,$O95,Data!CV:CV)","v":0},0,{"$f":"SUMIF(Data!$R:$R,$O95,Data!CE:CE)","v":0},{"$f":"SUMIF(Data!$R:$R,$O95,Data!CH:CH)","v":0},{"$f":"SUMIF(Data!$R:$R,$O95,Data!CK:CK)","v":0},{"$f":"SUMIF(Data!$R:$R,$O95,Data!CN:CN)","v":0},{"$f":"SUMIF(Data!$R:$R,$O95,Data!CQ:CQ)","v":0},{"$f":"SUMIF(Data!$R:$R,$O95,Data!CT:CT)","v":0},{"$f":"SUMIF(Data!$R:$R,$O95,Data!CW:CW)","v":0},{"$f":"SUMIF(Data!$R:$R,$O95,Data!CY:CY)","v":0},{"$f":"SUMIF(Data!$R:$R,$O95,Data!CZ:CZ)","v":0},0]
[null,null,null,null,null,null,null,null,null,null,null,null,null,null,"Tangyan",{"$f":"SUMIF(Data!$R:$R,$O96,Data!CD:CD)","v":0},{"$f":"SUMIF(Data!$R:$R,$O96,Data!CG:CG)","v":0},{"$f":"SUMIF(Data!$R:$R,$O96,Data!CJ:CJ)","v":0},{"$f":"SUMIF(Data!$R:$R,$O96,Data!CM:CM)","v":0},{"$f":"SUMIF(Data!$R:$R,$O96,Data!CP:CP)","v":0},{"$f":"SUMIF(Data!$R:$R,$O96,Data!CS:CS)","v":0},{"$f":"SUMIF(Data!$R:$R,$O96,Data!CV:CV)","v":0},0,{"$f":"SUMIF(Data!$R:$R,$O96,Data!CE:CE)","v":0},{"$f":"SUMIF(Data!$R:$R,$O96,Data!CH:CH)","v":0},{"$f":"SUMIF(Data!$R:$R,$O96,Data!CK:CK)","v":0},{"$f":"SUMIF(Data!$R:$R,$O96,Data!CN:CN)","v":0},{"$f":"SUMIF(Data!$R:$R,$O96,Data!CQ:CQ)","v":0},{"$f":"SUMIF(Data!$R:$R,$O96,Data!CT:CT)","v":0},{"$f":"SUMIF(Data!$R:$R,$O96,Data!CW:CW)","v":0},{"$f":"SUMIF(Data!$R:$R,$O96,Data!CY:CY)","v":0},{"$f":"SUMIF(Data!$R:$R,$O96,Data!CZ:CZ)","v":0},0]
[null,null,null,null,null,null,null,null,null,null,null,null,null,null,"Namhkan",{"$f":"SUMIF(Data!$R:$R,$O97,Data!CD:CD)","v":4},{"$f":"SUMIF(Data!$R:$R,$O97,Data!CG:CG)","v":0},{"$f":"SUMIF(Data!$R:$R,$O97,Data!CJ:CJ)","v":5},{"$f":"SUMIF(Data!$R:$R,$O97,Data!CM:CM)","v":3},{"$f":"SUMIF(Data!$R:$R,$O97,Data!CP:CP)","v":5},{"$f":"SUMIF(Data!$R:$R,$O97,Data!CS:CS)","v":1},{"$f":"SUMIF(Data!$R:$R,$O97,Data!CV:CV)","v":4},22,{"$f":"SUMIF(Data!$R:$R,$O97,Data!CE:CE)","v":3},{"$f":"SUMIF(Data!$R:$R,$O97,Data!CH:CH)","v":1},{"$f":"SUMIF(Data!$R:$R,$O97,Data!CK:CK)","v":4},{"$f":"SUMIF(Data!$R:$R,$O97,Data!CN:CN)","v":4},{"$f":"SUMIF(Data!$R:$R,$O97,Data!CQ:CQ)","v":4},{"$f":"SUMIF(Data!$R:$R,$O97,Data!CT:CT)","v":5},{"$f":"SUMIF(Data!$R:$R,$O97,Data!CW:CW)","v":16},{"$f":"SUMIF(Data!$R:$R,$O97,Data!CY:CY)","v":11},{"$f":"SUMIF(Data!$R:$R,$O97,Data!CZ:CZ)","v":32},80]
[null,null,null,null,null,null,null,null,null,null,null,null,null,null,"Mongmao",{"$f":"SUMIF(Data!$R:$R,$O98,Data!CD:CD)","v":0},{"$f":"SUMIF(Data!$R:$R,$O98,Data!CG:CG)","v":0},{"$f":"SUMIF(Data!$R:$R,$O98,Data!CJ:CJ)","v":0},{"$f":"SUMIF(Data!$R:$R,$O98,Data!CM:CM)","v":0},{"$f":"SUMIF(Data!$R:$R,$O98,Data!CP:CP)","v":0},{"$f":"SUMIF(Data!$R:$R,$O98,Data!CS:CS)","v":0},{"$f":"SUMIF(Data!$R:$R,$O98,Data!CV:CV)","v":0},0,{"$f":"SUMIF(Data!$R:$R,$O98,Data!CE:CE)","v":0},{"$f":"SUMIF(Data!$R:$R,$O98,Data!CH:CH)","v":0},{"$f":"SUMIF(Data!$R:$R,$O98,Data!CK:CK)","v":0},{"$f":"SUMIF(Data!$R:$R,$O98,Data!CN:CN)","v":0},{"$f":"SUMIF(Data!$R:$R,$O98,Data!CQ:CQ)","v":0},{"$f":"SUMIF(Data!$R:$R,$O98,Data!CT:CT)","v":0},{"$f":"SUMIF(Data!$R:$R,$O98,Data!CW:CW)","v":0},{"$f":"SUMIF(Data!$R:$R,$O98,Data!CY:CY)","v":0},{"$f":"SUMIF(Data!$R:$R,$O98,Data!CZ:CZ)","v":0},0]
[null,null,null,null,null,null,null,null,null,null,null,null,null,null,"TOTALS",{"$f":"SUM(P75:P98)","v":12},{"$f":"SUM(Q75:Q98)","v":2},18,23,10,11,10,86,12,3,19,38,11,26,40,{"$f":"SUM(AE75:AE98)","v":54},{"$f":"SUM(AF75:AF98)","v":138},{"$f":"SUM(AG75:AG98)","v":341}]
[null,null,null,null,null,null,null,null,null,null,null,null,null,"OVERALL TOTALS",null,{"$f":"P99+P74","v":302},{"$f":"Q99+Q74","v":132},269,226,691,95,244,1959,199,84,297,259,764,192,1274,{"$f":"AE99+AE74","v":709},{"$f":"AF99+AF74","v":1779},{"$f":"AG99+AG74","v":5557}]
[null,null,null,null,null,null,null,null,null,null,null,null,null,null,null,{"$f":"-P100","v":-302},-132,-269,-226,-691,-95,-244]

{"sheet":"Questionnaire","index":7,"n_rows":248,"n_cols":79,"rows_kept":248,"cut":false,"hidden":true,"merged":[[34,0,47,4],[34,5,34,73],[48,0,65,4],[48,5,48,73],[36,19,36,37],[38,19,38,37],[36,53,36,71],[38,53,38,71],[0,0,0,73],[2,0,4,73],[5,0,33,4],[5,5,5,73],[25,8,25,23],[25,25,25,36],[26,25,26,32],[8,41,8,42],[1,42,1,73],[1,25,1,41],[8,48,8,49],[10,20,10,21],[14,34,14,36],[15,34,15,36],[14,39,14,41],[14,46,14,48],[66,0,110,4],[66,5,66,73],[82,5,82,73],[111,0,134,4],[111,5,111,73],[135,0,197,2],[135,5,135,73],[136,3,148,4],[137,8,140,19],[137,21,139,30],[141,63,141,67],[141,68,141,72],[142,8,142,19],[142,21,142,25],[142,26,142,30],[142,33,142,41],[142,42,142,50],[142,53,142,57],[142,58,142,62],[141,8,141,19],[141,21,141,25],[141,26,141,30],[141,33,141,41],[141,42,141,50],[142,63,142,67],[142,68,142,72],[143,8,143,19],[143,21,143,25],[143,26,143,30],[143,33,143,41],[143,42,143,50],[143,53,143,57],[143,58,143,62],[143,63,143,67],[143,68,143,72],[144,8,144,19],[144,21,144,25],[144,26,144,30],[144,33,144,41],[144,42,144,50],[144,53,144,57],[144,58,144,62],[144,63,144,67],[144,68,144,72],[147,58,147,62],[147,63,147,67],[147,68,147,72],[145,63,145,67],[145,68,145,72],[146,8,146,19],[146,21,146,25],[146,26,146,30],[146,33,146,41],[146,42,146,50],[146,53,146,57],[146,58,146,62],[145,8,145,19],[145,21,145,25],[145,26,145,30],[145,33,145,41],[145,42,145,50],[145,53,145,57],[146,63,146,67],[146,68,146,72],[149,3,154,4],[155,3,167,4],[168,3,181,4],[182,3,190,4],[191,3,197,4],[156,37,156,38],[156,57,156,58],[157,37,157,38],[157,57,157,58],[163,57,163,58],[164,57,164,58],[160,43,160,44],[160,50,160,51],[160,57,160,58],[161,43,161,44],[161,50,161,51],[161,57,161,58],[175,33,175,36],[175,39,175,42],[175,45,175,48],[177,37,177,38],[177,44,177,45],[179,27,179,28],[193,42,193,43],[198,0,214,4],[198,5,198,73],[215,0,246,4],[215,5,215,73],[222,7,222,22],[222,23,222,30],[222,31,222,38],[222,39,222,72],[223,7,223,22],[223,23,223,30],[225,7,225,22],[225,23,225,30],[225,31,225,38],[225,39,225,72],[226,7,226,22],[226,23,226,30],[226,31,226,38],[226,39,226,72],[223,31,223,38],[223,39,223,72],[224,7,224,22],[224,23,224,30],[224,31,224,38],[224,39,224,72],[229,7,229,22],[229,23,229,30],[229,31,229,38],[229,39,229,72],[230,7,230,22],[230,23,230,30],[230,31,230,38],[230,39,230,72],[227,7,227,22],[227,23,227,30],[227,31,227,38],[227,39,227,72],[228,7,228,22],[228,23,228,30],[228,31,228,38],[228,39,228,72],[233,39,233,72],[234,7,234,22],[234,23,234,30],[234,31,234,38],[234,39,234,72],[231,7,231,22],[231,23,231,30],[231,31,231,38],[231,39,231,72],[232,7,232,22],[232,23,232,30],[232,31,232,38],[232,39,232,72],[247,0,247,73],[7,33,7,34],[7,41,7,42],[7,48,7,49],[7,57,7,58],[8,33,8,34],[243,7,243,22],[243,23,243,30],[243,31,243,38],[243,39,243,72],[244,7,244,22],[244,23,244,30],[244,31,244,38],[244,39,244,72],[241,7,241,22],[241,23,241,30],[241,31,241,38],[241,39,241,72],[242,7,242,22],[242,23,242,30],[242,31,242,38],[242,39,242,72],[239,7,239,22],[239,23,239,30],[237,7,237,22],[237,23,237,30],[237,31,237,38],[237,39,237,72],[238,7,238,22],[238,23,238,30],[30,9,30,13],[30,14,30,18],[30,19,30,23],[30,25,30,28],[30,29,30,32],[238,31,238,38],[238,39,238,72],[235,7,235,22],[235,23,235,30],[235,31,235,38],[235,39,235,72],[236,7,236,22],[236,23,236,30],[236,31,236,38],[236,39,236,72],[233,7,233,22],[233,23,233,30],[233,31,233,38],[245,7,245,22],[245,23,245,30],[245,31,245,38],[245,39,245,72],[239,31,239,38],[239,39,239,72],[240,7,240,22],[240,23,240,30],[240,31,240,38],[240,39,240,72],[29,9,29,13],[29,14,29,18],[29,19,29,23],[29,25,29,28],[29,29,29,32],[29,33,29,36],[29,38,29,43],[29,44,29,48],[29,49,29,53],[26,38,28,43],[26,69,28,73],[29,69,29,73],[15,39,15,41],[25,38,25,73],[31,19,31,23],[31,25,31,28],[31,29,31,32],[31,33,31,36],[31,38,31,43],[31,44,31,48],[31,49,31,53],[30,38,30,43],[30,44,30,48],[30,49,30,53],[30,33,30,36],[31,69,31,73],[15,46,15,48],[15,67,15,69],[8,53,8,73],[10,41,10,42],[10,55,10,56],[10,61,10,72],[26,9,28,13],[26,14,28,18],[26,19,28,23],[32,38,32,43],[32,44,32,48],[32,49,32,53],[32,54,32,58],[32,59,32,63],[32,64,32,68],[31,54,31,58],[31,59,31,63],[31,64,31,68],[32,9,32,13],[32,14,32,18],[32,19,32,23],[32,25,32,28],[32,29,32,32],[32,33,32,36],[31,9,31,13],[31,14,31,18],[32,69,32,73],[26,44,28,48],[26,49,28,53],[26,54,28,58],[26,59,28,63],[26,64,28,68],[30,54,30,58],[30,59,30,63],[30,64,30,68],[29,54,29,58],[29,59,29,63],[29,64,29,68],[30,69,30,73],[50,31,50,33],[50,40,50,44],[52,38,52,39],[52,46,52,47],[52,57,52,58],[52,66,52,67],[40,19,40,37],[40,53,40,71],[42,33,42,46],[42,56,42,70],[44,20,44,27],[46,35,46,36],[46,43,46,44],[46,50,46,51],[71,59,71,60],[73,27,73,28],[73,47,73,48],[60,39,60,40],[60,45,60,46],[62,43,62,61],[64,31,64,49],[64,56,64,73],[53,38,53,39],[53,46,53,47],[53,57,53,58],[53,66,53,67],[55,30,55,48],[58,44,58,51],[58,55,58,62],[75,43,75,44],[76,43,76,44],[75,53,75,54],[78,57,78,58],[79,57,79,58],[80,57,80,58],[68,43,68,44],[68,49,68,50],[71,27,71,28],[71,47,71,48],[87,33,87,37],[88,23,88,27],[88,28,88,32],[88,33,88,37],[78,63,78,64],[79,63,79,64],[80,63,80,64],[86,23,86,27],[86,28,86,32],[86,33,86,37],[86,58,86,62],[86,63,86,67],[97,23,97,27],[97,28,97,32],[97,33,97,37],[93,23,93,27],[93,28,93,32],[93,33,93,37],[94,23,94,27],[94,28,94,32],[94,33,94,37],[86,68,86,72],[87,58,87,62],[87,63,87,67],[87,68,87,72],[88,58,88,62],[88,63,88,67],[88,68,88,72],[96,23,96,27],[96,28,96,32],[96,33,96,37],[91,23,91,27],[91,28,91,32],[91,33,91,37],[92,23,92,27],[92,28,92,32],[92,33,92,37],[89,23,89,27],[89,28,89,32],[89,33,89,37],[90,23,90,27],[90,28,90,32],[90,33,90,37],[87,23,87,27],[87,28,87,32],[91,58,91,62],[91,63,91,67],[91,68,91,72],[92,58,92,62],[92,63,92,67],[92,68,92,72],[89,58,89,62],[89,63,89,67],[89,68,89,72],[90,58,90,62],[90,63,90,67],[90,68,90,72],[103,34,103,35],[103,45,103,46],[103,60,103,61],[104,34,104,35],[104,45,104,46],[104,60,104,61],[104,50,104,58],[93,63,93,67],[94,63,94,67],[99,43,99,49],[101,43,101,49],[99,61,99,67],[101,61,101,67],[108,34,108,35],[109,34,109,35],[108,45,108,46],[109,45,109,46],[108,60,108,61],[109,60,109,61],[109,50,109,58],[106,61,106,67],[106,43,106,49],[116,10,116,11],[116,23,116,24],[116,36,116,37],[116,48,116,49],[116,59,116,60],[116,53,116,58],[114,10,114,11],[114,23,114,24],[114,36,114,37],[114,48,114,49],[114,59,114,60],[115,59,115,60],[115,48,115,49],[115,36,115,37],[115,23,115,24],[115,10,115,11],[125,52,125,54],[125,48,125,50],[126,48,126,50],[126,52,126,54],[129,48,129,50],[129,52,129,54],[118,47,118,48],[118,54,118,55],[120,47,120,48],[120,54,120,55],[124,48,124,50],[124,52,124,54],[150,61,150,62],[153,43,153,44],[153,50,153,51],[132,10,132,11],[133,10,133,11],[132,26,132,27],[133,26,133,27],[132,43,132,44],[133,43,133,44],[145,58,145,62],[141,58,141,62],[137,33,139,50],[137,53,139,72],[140,21,140,25],[140,26,140,30],[140,33,140,41],[140,42,140,50],[140,53,140,57],[140,58,140,62],[140,63,140,67],[140,68,140,72],[147,8,147,19],[147,21,147,25],[147,26,147,30],[132,56,132,57],[166,38,166,39],[166,45,166,46],[169,41,169,42],[169,55,169,56],[170,41,170,42],[170,55,170,56],[163,43,163,44],[164,43,164,44],[163,50,163,51],[164,50,164,51],[133,31,133,39],[150,39,150,40],[150,50,150,51],[147,33,147,41],[147,42,147,50],[147,53,147,57],[141,53,141,57],[170,60,170,65],[172,52,172,53],[174,33,174,36],[174,39,174,42],[174,45,174,48],[184,64,184,72],[187,19,187,20],[192,42,192,43],[192,49,192,50],[192,56,192,57],[179,52,179,53],[180,27,180,28],[180,52,180,53],[183,36,183,37],[183,48,183,49],[183,59,183,60],[187,29,187,30],[188,19,188,20],[188,29,188,30],[189,19,189,20],[193,49,193,50],[193,56,193,57],[195,42,195,43],[195,49,195,50],[195,56,195,57],[184,36,184,37],[184,48,184,49],[184,59,184,60],[200,66,200,67],[187,44,187,45],[187,57,187,58],[188,44,188,45],[188,57,188,58],[189,44,189,45],[201,66,201,67],[201,47,201,48],[201,38,201,39],[201,23,201,24],[201,8,201,9],[201,52,201,60],[196,42,196,43],[196,49,196,50],[196,56,196,57],[200,8,200,9],[200,23,200,24],[200,38,200,39],[200,47,200,48],[204,8,204,9],[204,23,204,24],[204,38,204,39],[204,47,204,48],[204,66,204,67],[205,8,205,9],[205,23,205,24],[205,38,205,39],[205,47,205,48],[205,66,205,67],[209,8,209,9],[209,23,209,24],[209,38,209,39],[209,47,209,48],[209,66,209,67],[209,52,209,60],[205,52,205,60],[208,8,208,9],[208,23,208,24],[208,38,208,39],[208,47,208,48],[208,66,208,67],[213,66,213,67],[213,52,213,60],[212,8,212,9],[212,23,212,24],[212,38,212,39],[212,47,212,48],[212,66,212,67],[213,8,213,9],[213,23,213,24],[213,38,213,39],[213,47,213,48]]}
["SHELTER/NFI/CCCM CLUSTER CAMP PROFILING EXERCISE IN KACHIN & NORTHERN SHAN STATES",null,null,null,null,null,null,null,null,null,null,null,null,null,null,null,null,null,null,null,null,null,null,null,null,null,null,null,null,null,null,null,null,null,null,null,null,null,null,null,null,null,null,null,null,null,null,null,null,null,null,null,null,null,null,null,null,null,null,null,null,null,null,null,null,null,null,null,null,null,null,null,null,null,null,1,null,"a1_01",{"$f":"INDEX(INDIRECT(BZ1),RS)","v":"DRC"}]
["Camp level Questionnaire",null,null,null,null,null,null,null,null,null,null,null,null,null,null,null,null,null,null,null,null,null,null,null,null,{"$f":"INDEX(B6_01,RS)","v":"MMR001CMP001"},null,null,null,null,null,null,null,null,null,null,null,null,null,null,null,null,{"$f":"INDEX(B5_01,RS)","v":"Tat Kone Baptist Church"},null,null,null,null,null,null,null,null,null,null,null,null,null,null,null,null,null,null,null,null,null,null,null,null,null,null,null,null,null,null,null,null,"Tat Kone Baptist Church"]
["Introduction:\nIntroduce who you are.  Explain that you are collecting information for the humanitarian community about the overall situation of displaced people living in this camp. Explain that the information collected will be used to better plan for and coordinate humanitarian assistance."]
[]
[]
["A. Metadata",null,null,null,null,"TO BE FILLED BY INTERVIEWER."]
[]
[null,null,null,null,null,"A1",null,null,"Camp profiling responsible organization:",null,null,null,null,null,null,null,null,null,null,null,null,null,null,null,null,null,null,null,null,null,null,null,null,{"$f":"IF(INDEX(A1_01,RS)=AJ8,\"X\",\"\")","v":"X"},null,"DRC",null,null,null,null,null,{"$f":"IF(INDEX(A1_01,RS)=AR8,\"X\",\"\")","v":""},null,"KBC",null,null,null,null,{"$f":"IF(INDEX(A1_01,RS)=AY8,\"X\",\"\")","v":""},null,"KBSS/KMSS",null,null,null,null,null,null,{"$f":"IF(INDEX(A1_01,RS)=BH8,\"X\",\"\")","v":""},null,"SHALOM"]
[null,null,null,null,null,null,null,null," (tick √ one)",null,null,null,null,null,null,null,null,null,null,null,null,null,null,null,null,null,null,null,null,null,null,null,null,{"$f":"IF(INDEX(A1_01,RS)=AJ9,\"X\",\"\")","v":""},null,"RANIR",null,null,null,null,null,{"$f":"IF(INDEX(A1_01,RS)=AR9,\"X\",\"\")","v":""},null,"UNHCR",null,null,null,null,{"$f":"IF(INDEX(A1_01,RS)=AY9,\"X\",\"\")","v":""},null,"Other: ___________________",null,null,{"$f":"INDEX(A1_02,RS)","v":0}]
[null,null,null,null,null,null,null,null,null,null,null,null,null,null,null,null,null,null,null,null,null,null,null,null,null,null,null,null,null,null,null,null,null,null,null,null,null,null,null,null,null,null,null,null,null,null,null,null,null,null,null,null,null,null,null,null,null,null,null,null,null,null,null,null,null,null,null,null,null,null,null,null,null,null,null,"Accessibility","(All)"]
[null,null,null,null,null,"A2",null,null,"Type of interviewer:",null,null,null,null,null,null,null,null,null,null,null,{"$f":"IF(INDEX(A2_01,RS)=W11,\"X\",\"\")","v":""},null,"Enumerator from camp profiling",null,null,null,null,null,null,null,null,null,null,null,null,null,null,null,null,null,null,{"$f":"IF(INDEX(A2_01,RS)=AR11,\"X\",\"\")","v":""},null,"CCCM Focal Point",null,null,null,null,null,null,null,null,null,null,null,{"$f":"IF(INDEX(A2_01,RS)=BF11,\"X\",\"\")","v":""},null,"Other",null,null,null,{"$f":"INDEX(A2_02,RS)","v":0}]
[null,null,null,null,null,null,null,null," (tick √ one)",null,null,null,null,null,null,null,null,null,null,null,null,null," responsible organization",null,null,null,null,null,null,null,null,null,null,null,null,null,null,null,null,null,null,null,null,null,null,null,null,null,null,null,null,null,null,null,null,null,null,null,null,null,null,null,null,null,null,null,null,null,null,null,null,null,null,null,null,"Row Labels","Sum of Total"]
[null,null,null,null,null,null,null,null,null,null,null,null,null,null,null,null,null,null,null,null,null,null,null,null,null,null,null,null,null,null,null,null,null,null,null,null,null,null,null,null,null,null,null,null,null,null,null,null,null,null,null,null,null,null,null,null,null,null,null,null,null,null,null,null,null,null,null,null,null,null,null,null,null,null,null,"Kachin",80639]
[null,null,null,null,null,null,null,null,null,null,null,null,null,null,null,null,null,null,null,null,null,null,null,null,null,null,null,null,null,null,null,null,null,null,"Day",null,null,null,null,"Month",null,null,null,null,null,"Year",null,null,null,null,null,null,null,null,null,null,null,null,null,null,null,null,null,null,null,null,null,null,null,null,null,null,null,null,null,"Shan (North)",3154]
[null,null,null,null,null,"A3",null,null,"Date of interview/data collection:",null,null,null,null,null,null,null,null,null,null,null,null,null,null,null,null,null,"Start date:",null,null,null,null,null,null,null,{"$f":"INDEX(A3_01,RS)","v":{"$error":"#REF!"}},null,null,null,null,{"$f":"INDEX(A3_02,RS)","v":{"$error":"#REF!"}},null,null,null,null,2,0,{"$f":"INDEX(A3_03,RS)","v":{"$error":"#REF!"}},null,null,null,null,null,"A4",null,null,"Total number of visits",null,null,null,null,null,null,null,null,null,null,null,null,null,null,null,null,null,null,null,"Kyaukme",334]
[null,null,null,null,null,null,null,null,null,null,null,null,null,null,null,null,null,null,null,null,null,null,null,null,null,null,"Finish date:",null,null,null,null,null,null,null,{"$f":"INDEX(A3_11,RS)","v":{"$error":"#REF!"}},null,null,null,null,{"$f":"INDEX(A3_12,RS)","v":{"$error":"#REF!"}},null,null,null,null,2,0,{"$f":"INDEX(A3_13,RS)","v":{"$error":"#REF!"}},null,null,null,null,null,null,null,null,"to complete the form:",null,null,null,null,null,null,null,null,null,null,null,{"$f":"INDEX(A4_01,RS)","v":{"$error":"#REF!"}},null,null,null,null,null,null,null,"Muse",2820]
[null,null,null,null,null,null,null,null,null,null,null,null,null,null,null,null,null,null,null,null,null,null,null,null,null,null,null,null,null,null,null,null,null,null,null,null,null,null,null,null,null,null,null,null,null,null,null,null,null,null,null,null,null,null,null,null,null,null,null,null,null,null,null,null,null,null,null,null,null,null,null,null,null,null,null,"Grand Total",83793]
[null,null,null,null,null,"A5",null,null,"Who are the key informants for this questionnaire? "]
[]
[null,null,null,null,null,null,null,"Select the Camp Manager/Responsible as primary key informant for the interview; if some questions are not known by the camp "]
[null,null,null,null,null,null,null,"manager, select another key informant(s) who can provide general information about the camp (e.g. leader, teacher, doctor, etc.) "]
[null,null,null,null,null,null,null,"and enter information in the below table. For the final section (H) select 1 female camp resident (IDP) who can provide information "]
[null,null,null,null,null,null,null,"about the needs of camp residents (e.g. women's representative, etc.), to be interviewed SEPARATELY."]
[null,null,null,null,null,null,null,"Do NOT write down their names.  Use one line per key informant."]
[]
[null,null,null,null,null,null,null,null,"a. Informant (tick √ one per line)",null,null,null,null,null,null,null,null,null,null,null,null,null,null,null,null,"b. Demographic data",null,null,null,null,null,null,null,null,null,null,null,null,"c. Main position/occupation (tick √ one per line)"]
[null,null,null,null,null,null,null,null,null,"Camp Manager",null,null,null,null,"Camp Resident",null,null,null,null,"Other",null,null,null,null,null,"Sex (tick √)",null,null,null,null,null,null,null,"Age",null,null,null,null,"Committee Member",null,null,null,null,null,"FBO/NGO Staff",null,null,null,null,"Religious Leader",null,null,null,null,"Teacher",null,null,null,null,"Doctor / Nuerse / Midwife",null,null,null,null,"Authority",null,null,null,null,"Other"]
[null,null,null,null,null,null,null,null,null,null,null,null,null,null,null,null,null,null,null,null,null,null,null,null,null,"Male",null,null,null,"Female",null,null,null,"(Years)",null,null,null,null,null,null,null,null,null,null,"Staff",null,null,null,null,"Leader"]
[]
[null,null,null,null,null,null,null,null,1,{"$f":"IF(INDEX(A5_01,RS)=J$27,\"x\",\"\")","v":"x"},null,null,null,null,{"$f":"IF(INDEX(A5_01,RS)=O$27,\"x\",\"\")","v":""},null,null,null,null,{"$f":"IF(INDEX(A5_01,RS)=T$27,\"x\",\"\")","v":""},null,null,null,null,null,{"$f":"IF(INDEX(A5_02,RS)=Z$28,\"x\",\"\")","v":"x"},null,null,null,{"$f":"IF(INDEX(A5_02,RS)=AD$28,\"x\",\"\")","v":""},null,null,null,{"$f":"INDEX(A5_03,RS)","v":0},null,null,null,null,{"$f":"IF(INDEX(A5_04,RS)=AM$27,\"x\",\"\")","v":"x"},null,null,null,null,null,{"$f":"IF(INDEX(A5_04,RS)=AS$27,\"x\",\"\")","v":""},null,null,null,null,{"$f":"IF(INDEX(A5_04,RS)=AX$27,\"x\",\"\")","v":""},null,null,null,null,{"$f":"IF(INDEX(A5_04,RS)=BC$27,\"x\",\"\")","v":""},null,null,null,null,{"$f":"IF(INDEX(A5_04,RS)=BH$27,\"x\",\"\")","v":""},null,null,null,null,{"$f":"IF(INDEX(A5_04,RS)=BM$27,\"x\",\"\")","v":""},null,null,null,null,{"$f":"IF(INDEX(A5_04,RS)=BR$27,\"x\",\"\")","v":""}]
[null,null,null,null,null,null,null,null,2,{"$f":"IF(INDEX(A5_11,RS)=J$27,\"x\",\"\")","v":""},null,null,null,null,{"$f":"IF(INDEX(A5_11,RS)=O$27,\"x\",\"\")","v":""},null,null,null,null,{"$f":"IF(INDEX(A5_11,RS)=T$27,\"x\",\"\")","v":""},null,null,null,null,null,{"$f":"IF(INDEX(A5_12,RS)=Z$28,\"x\",\"\")","v":""},null,null,null,{"$f":"IF(INDEX(A5_12,RS)=AD$28,\"x\",\"\")","v":""},null,null,null,{"$f":"INDEX(A5_13,RS)","v":{"$error":"#REF!"}},null,null,null,null,{"$f":"IF(INDEX(A5_14,RS)=AM$27,\"x\",\"\")","v":{"$error":"#REF!"}},null,null,null,null,null,{"$f":"IF(INDEX(A5_14,RS)=AS$27,\"x\",\"\")","v":{"$error":"#REF!"}},null,null,null,null,{"$f":"IF(INDEX(A5_14,RS)=AX$27,\"x\",\"\")","v":{"$error":"#REF!"}},null,null,null,null,{"$f":"IF(INDEX(A5_14,RS)=BC$27,\"x\",\"\")","v":{"$error":"#REF!"}},null,null,null,null,{"$f":"IF(INDEX(A5_14,RS)=BH$27,\"x\",\"\")","v":{"$error":"#REF!"}},null,null,null,null,{"$f":"IF(INDEX(A5_14,RS)=BM$27,\"x\",\"\")","v":{"$error":"#REF!"}},null,null,null,null,{"$f":"IF(INDEX(A5_14,RS)=BR$27,\"x\",\"\")","v":{"$error":"#REF!"}}]
[null,null,null,null,null,null,null,null,3,{"$f":"IF(INDEX(A5_21,RS)=J$27,\"x\",\"\")","v":{"$error":"#REF!"}},null,null,null,null,{"$f":"IF(INDEX(A5_21,RS)=O$27,\"x\",\"\")","v":{"$error":"#REF!"}},null,null,null,null,{"$f":"IF(INDEX(A5_21,RS)=T$27,\"x\",\"\")","v":{"$error":"#REF!"}},null,null,null,null,null,{"$f":"IF(INDEX(A5_22,RS)=Z$28,\"x\",\"\")","v":{"$error":"#REF!"}},null,null,null,{"$f":"IF(INDEX(A5_22,RS)=AD$28,\"x\",\"\")","v":{"$error":"#REF!"}},null,null,null,{"$f":"INDEX(A5_23,RS)","v":{"$error":"#REF!"}},null,null,null,null,{"$f":"IF(INDEX(A5_24,RS)=AM$27,\"x\",\"\")","v":{"$error":"#REF!"}},null,null,null,null,null,{"$f":"IF(INDEX(A5_24,RS)=AS$27,\"x\",\"\")","v":{"$error":"#REF!"}},null,null,null,null,{"$f":"IF(INDEX(A5_24,RS)=AX$27,\"x\",\"\")","v":{"$error":"#REF!"}},null,null,null,null,{"$f":"IF(INDEX(A5_24,RS)=BC$27,\"x\",\"\")","v":{"$error":"#REF!"}},null,null,null,null,{"$f":"IF(INDEX(A5_24,RS)=BH$27,\"x\",\"\")","v":{"$error":"#REF!"}},null,null,null,null,{"$f":"IF(INDEX(A5_24,RS)=BM$27,\"x\",\"\")","v":{"$error":"#REF!"}},null,null,null,null,{"$f":"IF(INDEX(A5_24,RS)=BR$27,\"x\",\"\")","v":{"$error":"#REF!"}}]
[null,null,null,null,null,null,null,null,4,{"$f":"IF(INDEX(A5_31,RS)=J$27,\"x\",\"\")","v":{"$error":"#REF!"}},null,null,null,null,{"$f":"IF(INDEX(A5_03,RS)=O$27,\"x\",\"\")","v":""},null,null,null,null,{"$f":"IF(INDEX(A5_03,RS)=T$27,\"x\",\"\")","v":""},null,null,null,null,null,{"$f":"IF(INDEX(A5_32,RS)=Z$28,\"x\",\"\")","v":{"$error":"#REF!"}},null,null,null,{"$f":"IF(INDEX(A5_32,RS)=AD$28,\"x\",\"\")","v":{"$error":"#REF!"}},null,null,null,{"$f":"INDEX(A5_33,RS)","v":{"$error":"#REF!"}},null,null,null,null,{"$f":"IF(INDEX(A5_34,RS)=AM$27,\"x\",\"\")","v":{"$error":"#REF!"}},null,null,null,null,null,{"$f":"IF(INDEX(A5_34,RS)=AS$27,\"x\",\"\")","v":{"$error":"#REF!"}},null,null,null,null,{"$f":"IF(INDEX(A5_34,RS)=AX$27,\"x\",\"\")","v":{"$error":"#REF!"}},null,null,null,null,{"$f":"IF(INDEX(A5_34,RS)=BC$27,\"x\",\"\")","v":{"$error":"#REF!"}},null,null,null,null,{"$f":"IF(INDEX(A5_34,RS)=BH$27,\"x\",\"\")","v":{"$error":"#REF!"}},null,null,null,null,{"$f":"IF(INDEX(A5_34,RS)=BM$27,\"x\",\"\")","v":{"$error":"#REF!"}},null,null,null,null,{"$f":"IF(INDEX(A5_34,RS)=BR$27,\"x\",\"\")","v":{"$error":"#REF!"}}]
[]
["B. Geographic Data",null,null,null,null,"DATA AVAILABLE FROM CAMP LIST SHOULD BE PRE-FILLED IN THE FORMS. THE REST SHOULD BE FILLED BY INTERVIEWER."]
[]
[null,null,null,null,null,"B1",null,null,"State / Region",null,null,null,null,null,null,null,null,null,null,{"$f":"INDEX(B1_01,RS)","v":"Kachin"},null,null,null,null,null,null,null,null,null,null,null,null,null,null,null,null,null,null,null,"B2",null,null,"Township",null,null,null,null,null,null,null,null,null,null,{"$f":"INDEX(B2_01,RS)","v":"Myitkyina"}]
[]
[null,null,null,null,null,"B3",null,null,"Village Tract/Town",null,null,null,null,null,null,null,null,null,null,{"$f":"INDEX(B3_01,RS)","v":"Urban"},null,null,null,null,null,null,null,null,null,null,null,null,null,null,null,null,null,null,null,"B4",null,null,"Village/Ward",null,null,null,null,null,null,null,null,null,null,{"$f":"INDEX(B4_01,RS)","v":"Tat Kone"}]
[]
[null,null,null,null,null,"B5",null,null,"Camp Name",null,null,null,null,null,null,null,null,null,null,{"$f":"INDEX(B5_01,RS)","v":"Tat Kone Baptist Church"},null,null,null,null,null,null,null,null,null,null,null,null,null,null,null,null,null,null,null,"B6",null,null,"Pcode",null,null,null,null,null,null,null,null,null,null,{"$f":"INDEX(B6_01,RS)","v":"MMR001CMP001"}]
[]
[null,null,null,null,null,"B7",null,null,"GPS Coordinates (DD,DDDD)",null,null,null,null,null,null,null,null,null,null,null,null,null,null,null,"a) Longitude:",null,null,null,null,null,null,null,null,{"$f":"INDEX(B7_01,RS)","v":97.386718999999999},null,null,null,null,null,null,null,null,null,null,null,null,null,null,null,"b) Latitude:",null,null,null,null,null,null,{"$f":"INDEX(B7_02,RS)","v":25.415482000000001}]
[]
[null,null,null,null,null,"B8",null,null,"Altitude (in meters):",null,null,null,null,null,null,null,null,null,null,null,{"$f":"INDEX(B8_01,RS)","v":{"$error":"#REF!"}}]
[]
[null,null,null,null,null,"B9",null,null,"Type of location (complete by observation; tick √ one)",null,null,null,null,null,null,null,null,null,null,null,null,null,null,null,null,null,null,null,null,null,null,null,null,null,null,{"$f":"IF(INDEX(B9_01,RS)=AL47,\"X\",\"\")","v":"X"},null,"Urban",null,null,null,null,null,{"$f":"IF(INDEX(B9_01,RS)=AT47,\"X\",\"\")","v":""},null,"Rural",null,null,null,null,{"$f":"IF(INDEX(B9_01,RS)=BA47,\"X\",\"\")","v":""},null,"Forest/bush"]
[]
["C. General Information",null,null,null,null,"COLLECT THIS INFORMATION FROM CAMP MANAGER/RESPONSIBLE (DATA FROM PREVIOUS PROFILINGS SHOULD BE PRE-FILLED)"]
[]
[null,null,null,null,null,"C1",null,null,"Date of Establishment of the Camp",null,null,null,null,null,null,null,null,null,null,null,null,null,null,null,null,null,null,"Month",null,null,null,{"$f":"INDEX(_C1_01,RS)","v":6},null,null,null,null,null,"Year",null,null,{"$f":"INDEX(_C1_02,RS)","v":2011}]
[]
[null,null,null,null,null,"C2",null,null,"Access to the camp: (tick √ all that apply) ",null,null,null,null,null,null,null,null,null,null,null,null,null,null,null,null,null,null,null,"a) Dry season",null,null,null,null,null,null,null,null,null,{"$f":"IF(INDEX(_C2_01,RS)=\"YES\",\"x\",\"\")","v":"x"},null,"By foot",null,null,null,null,null,{"$f":"IF(INDEX(_C2_02,RS)=\"YES\",\"x\",\"\")","v":"x"},null,"By motorbike",null,null,null,null,null,null,null,null,{"$f":"IF(INDEX(_C2_03,RS)=\"YES\",\"x\",\"\")","v":"x"},null,"By car/ 4WD",null,null,null,null,null,null,{"$f":"IF(INDEX(_C2_04,RS)=\"YES\",\"x\",\"\")","v":""},null,"By water"]
[null,null,null,null,null,null,null,null,null,null,null,null,null,null,null,null,null,null,null,null,null,null,null,null,null,null,null,null,"b) Rainy season",null,null,null,null,null,null,null,null,null,{"$f":"IF(INDEX(_C2_11,RS)=\"YES\",\"x\",\"\")","v":"x"},null,"By foot",null,null,null,null,null,{"$f":"IF(INDEX(_C2_12,RS)=\"YES\",\"x\",\"\")","v":"x"},null,"By motorbike",null,null,null,null,null,null,null,null,{"$f":"IF(INDEX(_C2_13,RS)=\"YES\",\"x\",\"\")","v":"x"},null,"By car/ 4WD",null,null,null,null,null,null,{"$f":"IF(INDEX(_C2_14,RS)=\"YES\",\"x\",\"\")","v":""},null,"By water"]
[]
[null,null,null,null,null,"C3",null,null,"Name of nearest town from the camp:",null,null,null,null,null,null,null,null,null,null,null,null,null,null,null,null,null,null,null,null,null,{"$f":"INDEX(_C3_01,RS)","v":"Myitkyina"}]
[]
[null,null,null,null,null,null,null,null,null,null,null,null,null,null,null,null,null,null,null,null,null,null,null,null,null,null,null,null,null,null,null,null,null,null,null,null,null,null,null,null,null,null,null,null,"Distance (in miles)",null,null,null,null,null,null,null,null,null,null,"Time (in minutes)"]
[null,null,null,null,null,"C4",null,null,"How far is the nearest town from the camp? (answer at least one)",null,null,null,null,null,null,null,null,null,null,null,null,null,null,null,null,null,null,null,null,null,null,null,null,null,null,null,null,null,null,null,null,null,null,null,{"$f":"INDEX(_C4_01,RS)","v":0},null,null,null,null,null,null,null,null,null,null,{"$f":"INDEX(_C4_02,RS)","v":10}]
[]
[null,null,null,null,null,"C5",null,null,"Does the Camp have a Management / Responsible Agency?",null,null,null,null,null,null,null,null,null,null,null,null,null,null,null,null,null,null,null,null,null,null,null,null,null,null,null,null,null,null,{"$f":"IF(INDEX(_C2_01,RS)=\"YES\",\"x\",\"\")","v":"x"},null,"Yes",null,null,null,{"$f":"IF(INDEX(_C2_01,RS)=\"No\",\"x\",\"\")","v":""},null,"No"]
[]
[null,null,null,null,null,"C6",null,null,"If Yes, What is the name of Camp Management/Responsible Agency:",null,null,null,null,null,null,null,null,null,null,null,null,null,null,null,null,null,null,null,null,null,null,null,null,null,null,null,null,null,null,null,null,null,null,{"$f":"INDEX(_C6_01,RS)","v":"KBC"}]
[]
[null,null,null,null,null,"C7",null,null,"Camp manager/responsible person:",null,null,null,null,null,null,null,null,null,null,null,null,null,null,null,null,null,null,"Name:",null,null,null,{"$f":"INDEX(_C7_01,RS)","v":"Bawk Htoi Naw"},null,null,null,null,null,null,null,null,null,null,null,null,null,null,null,null,null,null,null,null,"Phone:",null,null,null,{"$f":"INDEX(_C7_02,RS)","v":"09 -4702709 6"}]
[]
["D. Basic Demographic Data",null,null,null,null,"COLLECT THIS INFORMATION FROM CAMP MANAGER/RESPONSIBLE"]
[]
[null,null,null,null,null,"D1",null,null,"Is there a registration book/list of residents available in the camp? ",null,null,null,null,null,null,null,null,null,null,null,null,null,null,null,null,null,null,null,null,null,null,null,null,null,null,null,null,null,null,null,null,null,null,{"$f":"IF(INDEX(D1_01,RS)=\"YES\",\"x\",\"\")","v":"x"},null,"Yes",null,null,null,{"$f":"IF(INDEX(D1_01,RS)=\"No\",\"x\",\"\")","v":""},null,"No"]
[]
[null,null,null,null,null,null,null,null,"If YES, ask the following questions (D2 to D4); if NOT go to question D5"]
[null,null,null,null,null,"D2",null,null,"How frequently is the registration",null,null,null,null,null,null,null,null,null,null,null,null,null,null,null,null,null,null,{"$f":"IF(INDEX(D2_01,RS)=\"YES\",\"x\",\"\")","v":""},null,"With each population change ",null,null,null,null,null,null,null,null,null,null,null,null,null,null,null,null,null,{"$f":"IF(INDEX(D2_02,RS)=\"YES\",\"x\",\"\")","v":""},null,"At least weekly",null,null,null,null,null,null,null,null,null,{"$f":"IF(INDEX(D2_03,RS)=\"YES\",\"x\",\"\")","v":"x"},null,"At least monthly"]
[null,null,null,null,null,null,null,null,"book/list updated?: (tick √ one)",null,null,null,null,null,null,null,null,null,null,null,null,null,null,null,null,null,null,null,null," (arrival, departure, death or birth)"]
[null,null,null,null,null,null,null,null,null,null,null,null,null,null,null,null,null,null,null,null,null,null,null,null,null,null,null,{"$f":"IF(INDEX(D2_04,RS)=\"YES\",\"x\",\"\")","v":""},null,"Less frequent than monthly",null,null,null,null,null,null,null,null,null,null,null,null,null,null,null,null,null,{"$f":"IF(INDEX(D2_05,RS)=\"YES\",\"x\",\"\")","v":""},null,"Never updated"]
[]
[null,null,null,null,null,"D3",null,null,"Is there an electronic copy of the registration information available?",null,null,null,null,null,null,null,null,null,null,null,null,null,null,null,null,null,null,null,null,null,null,null,null,null,null,null,null,null,null,null,null,null,null,{"$f":"IF(INDEX(D3_01,RS)=\"YES\",\"x\",\"\")","v":""},null,"Yes, in camp",null,null,null,null,null,null,null,{"$f":"IF(INDEX(D3_02,RS)=\"YES\",\"x\",\"\")","v":""},null,"Yes, in camp management "]
[null,null,null,null,null,null,null,null,"(tick √ all that apply ) ",null,null,null,null,null,null,null,null,null,null,null,null,null,null,null,null,null,null,null,null,null,null,null,null,null,null,null,null,null,null,null,null,null,null,{"$f":"IF(INDEX(D3_03,RS)=\"YES\",\"x\",\"\")","v":"x"},null,"No",null,null,null,null,null,null,null,null,null,"/responsible agency"]
[]
[null,null,null,null,null,"D4",null,null,"Is the following information systematically collected in ",null,null,null,null,null,null,null,null,null,null,null,null,null,null,null,null,null,null,null,null,null,null,null,null,null,null,null,null,null,null,null,null,null,"a) Date of birth",null,null,null,null,null,null,null,null,null,null,null,null,null,null,{"$f":"IF(INDEX(D4_01,RS)=\"YES\",\"x\",\"\")","v":"x"},null,"Yes",null,null,null,{"$f":"IF(INDEX(D4_01,RS)=\"No\",\"x\",\"\")","v":""},null,"No"]
[null,null,null,null,null,null,null,null,"the registration book/list:",null,null,null,null,null,null,null,null,null,null,null,null,null,null,null,null,null,null,null,null,null,null,null,null,null,null,null,null,null,null,null,null,null,"b) Age (in years)",null,null,null,null,null,null,null,null,null,null,null,null,null,null,{"$f":"IF(INDEX(D4_02,RS)=\"YES\",\"x\",\"\")","v":"x"},null,"Yes",null,null,null,{"$f":"IF(INDEX(D4_03,RS)=\"No\",\"x\",\"\")","v":""},null,"No"]
[null,null,null,null,null,null,null,null,null,null,null,null,null,null,null,null,null,null,null,null,null,null,null,null,null,null,null,null,null,null,null,null,null,null,null,null,null,null,null,null,null,null,"c) Date of entry into camp",null,null,null,null,null,null,null,null,null,null,null,null,null,null,{"$f":"IF(INDEX(D4_03,RS)=\"YES\",\"x\",\"\")","v":"x"},null,"Yes",null,null,null,{"$f":"IF(INDEX(D4_03,RS)=\"No\",\"x\",\"\")","v":""},null,"No"]
[]
[null,null,null,null,null,"IF AVAILABLE, COLLECT THE FOLLOWING INFORMATION FROM THE REGISTRATION BOOK/LIST"]
[]
[null,null,null,null,null,null,null,null,"POPULATION LIVING IN THE CAMP, BY AGE GROUPS:",null,null,null,null,null,null,null,null,null,null,null,null,null,null,null,null,null,null,null,null,null,null,null,null,null,null,null,null,null,null,null,null,null,"POPULATION LIVING IN THE CAMP, BY VULNERABILITY:"]
[null,null,null,null,null,null,null,null,"Completed months or years",null,null,null,null,null,null,null,null,null,null,null,null,null,null,"Male",null,null,null,null,"Female",null,null,null,null,"Total",null,null,null,null,null,null,null,null,"Type of Vulnerability",null,null,null,null,null,null,null,null,null,null,null,null,null,null,null,"Male",null,null,null,null,"Female",null,null,null,null,"Total"]
[null,null,null,null,null,"D5",null,null,"0 to 5 months",null,null,null,null,null,null,null,null,null,null,null,null,null,null,{"$f":"INDEX(D5_01,RS)","v":0},null,null,null,null,{"$f":"INDEX(D5_02,RS)","v":2},null,null,null,null,{"$f":"INDEX(D5_03,RS)","v":0},null,null,null,null,null,"D14",null,null,"Physically Disabled",null,null,null,null,null,null,null,null,null,null,null,null,null,null,null,{"$f":"INDEX(D14_01,RS)","v":3},null,null,null,null,{"$f":"INDEX(D14_02,RS)","v":0},null,null,null,null,{"$f":"INDEX(D14_03,RS)","v":3}]
[null,null,null,null,null,"D6",null,null,"6 to 23 months",null,null,null,null,null,null,null,null,null,null,null,null,null,null,{"$f":"INDEX(D6_01,RS)","v":4},null,null,null,null,{"$f":"INDEX(D6_02,RS)","v":5},null,null,null,null,{"$f":"INDEX(D6_03,RS)","v":0},null,null,null,null,null,"D15",null,null,"Mentally Disabled",null,null,null,null,null,null,null,null,null,null,null,null,null,null,null,{"$f":"INDEX(D15_01,RS)","v":1},null,null,null,null,{"$f":"INDEX(D15_02,RS)","v":0},null,null,null,null,{"$f":"INDEX(D15_03,RS)","v":1}]
[null,null,null,null,null,"D7",null,null,"2 to 4 years",null,null,null,null,null,null,null,null,null,null,null,null,null,null,{"$f":"INDEX(D7_01,RS)","v":8},null,null,null,null,{"$f":"INDEX(D7_02,RS)","v":10},null,null,null,null,{"$f":"INDEX(D7_03,RS)","v":0},null,null,null,null,null,"D16",null,null,"Chronically ill",null,null,null,null,null,null,null,null,null,null,null,null,null,null,null,{"$f":"INDEX(D16_01,RS)","v":1},null,null,null,null,{"$f":"INDEX(D16_02,RS)","v":1},null,null,null,null,{"$f":"INDEX(D16_03,RS)","v":2}]
[null,null,null,null,null,"D8",null,null,"5 to 11 years",null,null,null,null,null,null,null,null,null,null,null,null,null,null,{"$f":"INDEX(D8_01,RS)","v":27},null,null,null,null,{"$f":"INDEX(D8_02,RS)","v":19},null,null,null,null,{"$f":"INDEX(D8_03,RS)","v":0},null,null,null,null,null,"D17",null,null,"Unaccompanied children (<18)",null,null,null,null,null,null,null,null,null,null,null,null,null,null,null,{"$f":"INDEX(D17_01,RS)","v":4},null,null,null,null,{"$f":"INDEX(D17_02,RS)","v":4},null,null,null,null,{"$f":"INDEX(D17_03,RS)","v":8}]
[null,null,null,null,null,"D9",null,null,"12 to 17 years",null,null,null,null,null,null,null,null,null,null,null,null,null,null,{"$f":"INDEX(D9_01,RS)","v":15},null,null,null,null,{"$f":"INDEX(D9_02,RS)","v":20},null,null,null,null,{"$f":"INDEX(D9_03,RS)","v":0},null,null,null,null,null,"D18",null,null,"Separated children (<18)",null,null,null,null,null,null,null,null,null,null,null,null,null,null,null,{"$f":"INDEX(D18_01,RS)","v":0},null,null,null,null,{"$f":"INDEX(D18_02,RS)","v":1},null,null,null,null,{"$f":"INDEX(D18_03,RS)","v":1}]
[null,null,null,null,null,"D10",null,null,"18 to 35 years",null,null,null,null,null,null,null,null,null,null,null,null,null,null,{"$f":"INDEX(D10_01,RS)","v":25},null,null,null,null,{"$f":"INDEX(D10_02,RS)","v":28},null,null,null,null,{"$f":"INDEX(D10_03,RS)","v":0},null,null,null,null,null,"D19",null,null,"Unaccompanied elders (>60)",null,null,null,null,null,null,null,null,null,null,null,null,null,null,null,{"$f":"INDEX(D19_01,RS)","v":0},null,null,null,null,{"$f":"INDEX(D19_02,RS)","v":0},null,null,null,null,{"$f":"INDEX(D19_03,RS)","v":0}]
[null,null,null,null,null,"D11",null,null,"36 to 59 years ",null,null,null,null,null,null,null,null,null,null,null,null,null,null,{"$f":"INDEX(D11_01,RS)","v":28},null,null,null,null,{"$f":"INDEX(D11_02,RS)","v":32},null,null,null,null,{"$f":"INDEX(D11_03,RS)","v":0},null,null,null,null,null,"D20",null,null,"Single headed households",null,null,null,null,null,null,null,null,null,null,null,null,null,null,null,{"$f":"INDEX(D20_01,RS)","v":0},null,null,null,null,{"$f":"INDEX(D20_02,RS)","v":0},null,null,null,null,{"$f":"INDEX(D20_03,RS)","v":0}]
[null,null,null,null,null,"D12",null,null,"60 years and above",null,null,null,null,null,null,null,null,null,null,null,null,null,null,{"$f":"INDEX(D12_01,RS)","v":5},null,null,null,null,{"$f":"INDEX(D12_02,RS)","v":11},null,null,null,null,{"$f":"INDEX(D12_03,RS)","v":0},null,null,null,null,null,"D21",null,null,"Pregnant women",null,null,null,null,null,null,null,null,null,null,null,null,null,null,null,null,null,null,null,null,{"$f":"INDEX(D21_01,RS)","v":1}]
[null,null,null,null,null,"D13",null,null,"Total",null,null,null,null,null,null,null,null,null,null,null,null,null,null,{"$f":"INDEX(D13_01,RS)","v":112},null,null,null,null,{"$f":"INDEX(D13_02,RS)","v":127},null,null,null,null,{"$f":"INDEX(D13_03,RS)","v":239},null,null,null,null,null,"D22",null,null,"Lactating women",null,null,null,null,null,null,null,null,null,null,null,null,null,null,null,null,null,null,null,null,{"$f":"INDEX(D22_01,RS)","v":11}]
[]
[null,null,null,null,null,"D23",null,null,"Births in last 6 months",null,null,null,null,null,null,null,null,null,null,null,null,null,null,{"$f":"INDEX(D23_01,RS)","v":1},null,null,null,null,{"$f":"INDEX(D23_02,RS)","v":0},null,null,null,null,{"$f":"INDEX(D23_03,RS)","v":1}]
[null,null,null,null,null,"D24",null,null,"Deaths in last 6 months",null,null,null,null,null,null,null,null,null,null,null,null,null,null,{"$f":"INDEX(D24_01,RS)","v":0},null,null,null,null,{"$f":"INDEX(D24_02,RS)","v":0},null,null,null,null,{"$f":"INDEX(D24_03,RS)","v":0}]
[]
[null,null,null,null,null,"D25",null,null,"Total number of IDPs living in the camp:",null,null,null,null,null,null,null,null,null,null,null,null,null,null,null,null,null,null,null,null,null,null,null,null,null,"a) Households:",null,null,null,null,null,null,null,null,{"$f":"INDEX(D25_01,RS)","v":54},null,null,null,null,null,null,null,null,null,null,"b) Persons",null,null,null,null,null,null,{"$f":"INDEX(D25_02,RS)","v":239}]
[]
[null,null,null,null,null,"D26",null,null,"Permanent arrivals to camp in last 6 months:",null,null,null,null,null,null,null,null,null,null,null,null,null,null,null,null,null,null,null,null,null,null,null,null,null,"a) Households:",null,null,null,null,null,null,null,null,{"$f":"INDEX(D26_01,RS)","v":1},null,null,null,null,null,null,null,null,null,null,"b) Persons",null,null,null,null,null,null,{"$f":"INDEX(D26_02,RS)","v":5}]
[]
[null,null,null,null,null,"D27",null,null,"What was the previous location of the majority ",null,null,null,null,null,null,null,null,null,null,null,null,null,null,null,null,null,null,null,null,null,null,null,null,null,{"$f":"IF(INDEX(D27_01,RS)=AK104,\"X\",\"\")","v":{"$error":"#REF!"}},null,"Place of origin",null,null,null,null,null,null,null,null,{"$f":"IF(INDEX(D27_01,RS)=AV104,\"X\",\"\")","v":{"$error":"#REF!"}},null,"Host families",null,null,null,null,null,null,null,null,null,null,null,null,{"$f":"IF(INDEX(D27_01,RS)=BK104,\"X\",\"\")","v":{"$error":"#REF!"}},null,"Other IDP camps"]
[null,null,null,null,null,null,null,null,"of arrivals in the last 6 months? (tick √ only one)",null,null,null,null,null,null,null,null,null,null,null,null,null,null,null,null,null,null,null,null,null,null,null,null,null,{"$f":"IF(INDEX(D27_01,RS)=AK105,\"X\",\"\")","v":{"$error":"#REF!"}},null,"Abroad",null,null,null,null,null,null,null,null,{"$f":"IF(INDEX(D27_01,RS)=AV105,\"X\",\"\")","v":{"$error":"#REF!"}},null,"Other",null,null,{"$f":"INDEX(D27_02,RS)","v":{"$error":"#REF!"}},null,null,null,null,null,null,null,null,null,{"$f":"IF(INDEX(D27_01,RS)=BK105,\"X\",\"\")","v":{"$error":"#REF!"}},null,"Don't know"]
[]
[null,null,null,null,null,"D28",null,null,"Permanent departures from camp in last 6 months:",null,null,null,null,null,null,null,null,null,null,null,null,null,null,null,null,null,null,null,null,null,null,null,null,null,"a) Households:",null,null,null,null,null,null,null,null,{"$f":"INDEX(D28_01,RS)","v":7},null,null,null,null,null,null,null,null,null,null,"b) Persons",null,null,null,null,null,null,{"$f":"INDEX(D28_02,RS)","v":25}]
[]
[null,null,null,null,null,"D29",null,null,"What was the destination of the majority of",null,null,null,null,null,null,null,null,null,null,null,null,null,null,null,null,null,null,null,null,null,null,null,null,null,{"$f":"IF(INDEX(D29_01,RS)=AK109,\"X\",\"\")","v":{"$error":"#REF!"}},null,"Place of origin",null,null,null,null,null,null,null,null,{"$f":"IF(INDEX(D29_01,RS)=AV109,\"X\",\"\")","v":{"$error":"#REF!"}},null,"Host families",null,null,null,null,null,null,null,null,null,null,null,null,{"$f":"IF(INDEX(D29_01,RS)=BK109,\"X\",\"\")","v":{"$error":"#REF!"}},null,"Other IDP camps"]
[null,null,null,null,null,null,null,null,"departures in the last 6 months? (tick √ only one)",null,null,null,null,null,null,null,null,null,null,null,null,null,null,null,null,null,null,null,null,null,null,null,null,null,{"$f":"IF(INDEX(D29_01,RS)=AK110,\"X\",\"\")","v":{"$error":"#REF!"}},null,"Abroad",null,null,null,null,null,null,null,null,{"$f":"IF(INDEX(D29_01,RS)=AV110,\"X\",\"\")","v":{"$error":"#REF!"}},null,"Other",null,null,{"$f":"INDEX(D29_02,RS)","v":{"$error":"#REF!"}},null,null,null,null,null,null,null,null,null,{"$f":"IF(INDEX(D29_01,RS)=BK110,\"X\",\"\")","v":{"$error":"#REF!"}},null,"Don't know"]
[]
["E. Camp Coordination and  Management ",null,null,null,null,"COLLECT THIS INFORMATION FROM CAMP MANAGER/RESPONSIBLE"]
[]
[null,null,null,null,null,"E1",null,null,"Which of the following responsibilities have been defined in the camp: (tick √ all that apply ) "]
[null,null,null,null,null,null,null,null,null,null,{"$f":"IF(INDEX(E1_01,RS)=\"Yes\",\"X\",\"\")","v":{"$error":"#REF!"}},null,"Registration",null,null,null,null,null,null,null,null,null,null,{"$f":"IF(INDEX(E1_02,RS)=\"Yes\",\"X\",\"\")","v":{"$error":"#REF!"}},null,"Coordination",null,null,null,null,null,null,null,null,null,null,{"$f":"IF(INDEX(E1_03,RS)=\"Yes\",\"X\",\"\")","v":{"$error":"#REF!"}},null,"Management",null,null,null,null,null,null,null,null,null,{"$f":"IF(INDEX(E1_04,RS)=\"Yes\",\"X\",\"\")","v":{"$error":"#REF!"}},null,"Data collection",null,null,null,null,null,null,null,null,{"$f":"IF(INDEX(E1_05,RS)=\"Yes\",\"X\",\"\")","v":{"$error":"#REF!"}},null,"Water"]
[null,null,null,null,null,null,null,null,null,null,{"$f":"IF(INDEX(E1_06,RS)=\"Yes\",\"X\",\"\")","v":{"$error":"#REF!"}},null,"Sanitation",null,null,null,null,null,null,null,null,null,null,{"$f":"IF(INDEX(E1_07,RS)=\"Yes\",\"X\",\"\")","v":{"$error":"#REF!"}},null,"Care and Maintenance",null,null,null,null,null,null,null,null,null,null,{"$f":"IF(INDEX(E1_08,RS)=\"Yes\",\"X\",\"\")","v":{"$error":"#REF!"}},null,"Child care/protection",null,null,null,null,null,null,null,null,null,{"$f":"IF(INDEX(E1_09,RS)=\"Yes\",\"X\",\"\")","v":{"$error":"#REF!"}},null,"Health care",null,null,null,null,null,null,null,null,{"$f":"IF(INDEX(E1_10,RS)=\"Yes\",\"X\",\"\")","v":{"$error":"#REF!"}},null,"Education"]
[null,null,null,null,null,null,null,null,null,null,{"$f":"IF(INDEX(E1_11,RS)=\"Yes\",\"X\",\"\")","v":{"$error":"#REF!"}},null,"Food distribution",null,null,null,null,null,null,null,null,null,null,{"$f":"IF(INDEX(E1_12,RS)=\"Yes\",\"X\",\"\")","v":{"$error":"#REF!"}},null,"Culture",null,null,null,null,null,null,null,null,null,null,{"$f":"IF(INDEX(E1_13,RS)=\"Yes\",\"X\",\"\")","v":{"$error":"#REF!"}},null,"Religious activities",null,null,null,null,null,null,null,null,null,{"$f":"IF(INDEX(E1_14,RS)=\"Yes\",\"X\",\"\")","v":{"$error":"#REF!"}},null,"Other",null,null,{"$f":"INDEX(E1_02,RS)","v":{"$error":"#REF!"}},null,null,null,null,null,{"$f":"IF(INDEX(E1_16,RS)=\"Yes\",\"X\",\"\")","v":{"$error":"#REF!"}},null,"None"]
[]
[null,null,null,null,null,"E2",null,null,"Is there an anonymous complaints mechanism in place for camp residents?",null,null,null,null,null,null,null,null,null,null,null,null,null,null,null,null,null,null,null,null,null,null,null,null,null,null,null,null,null,null,null,null,null,null,null,null,null,null,{"$f":"IF(INDEX(E2_01,RS)=\"Yes\",\"X\",\"\")","v":"X"},null,"Yes",null,null,null,null,{"$f":"IF(INDEX(E2_01,RS)=\"NO\",\"X\",\"\")","v":""},null,"No"]
[]
[null,null,null,null,null,"E3",null,null,"Is there a camp management committee currently in place?",null,null,null,null,null,null,null,null,null,null,null,null,null,null,null,null,null,null,null,null,null,null,null,null,null,null,null,null,null,null,null,null,null,null,null,null,null,null,{"$f":"IF(INDEX(E3_01,RS)=\"Yes\",\"X\",\"\")","v":"X"},null,"Yes",null,null,null,null,{"$f":"IF(INDEX(E3_01,RS)=\"NO\",\"X\",\"\")","v":""},null,"No"]
[]
[null,null,null,null,null,null,null,null,"If there is a camp management committee in place, ask the following questions (E4 to E6); if NOT go to next section (F1)."]
[null,null,null,null,null,null,null,null,null,null,null,null,null,null,null,null,null,null,null,null,null,null,null,null,null,null,null,null,null,null,null,null,null,null,null,null,null,null,null,null,null,null,null,null,null,null,null,null,"Male",null,null,null,"Female"]
[null,null,null,null,null,"E4",null,null,"Number of camp management committee members:",null,null,null,null,null,null,null,null,null,null,null,null,null,null,null,null,null,null,null,null,null,null,null,null,null,null,null,null,"a) IDP members",null,null,null,null,null,null,null,null,null,null,{"$f":"INDEX(E4_01,RS)","v":11},null,null,null,{"$f":"INDEX(E4_02,RS)","v":5}]
[null,null,null,null,null,null,null,null,null,null,null,null,null,null,null,null,null,null,null,null,null,null,null,null,null,null,null,null,null,null,null,null,null,null,null,null,null,"b) Non-IDP members",null,null,null,null,null,null,null,null,null,null,{"$f":"INDEX(E4_03,RS)","v":2},null,null,null,{"$f":"INDEX(E4_04,RS)","v":0}]
[null,null,null,null,null,null,null,null,null,null,null,null,null,null,null,null,null,null,null,null,null,null,null,null,null,null,null,null,null,null,null,null,null,null,null,null,null,"c) Total members",null,null,null,null,null,null,null,null,null,null,{"$f":"INDEX(E4_05,RS)","v":13},null,null,null,{"$f":"INDEX(E4_06,RS)","v":5}]
[null,null,null,null,null,null,null,null,null,null,null,null,null,null,null,null,null,null,null,null,null,null,null,null,null,null,null,null,null,null,null,null,null,null,null,null,null,null,null,null,null,null,null,null,null,null,null,null,"Male",null,null,null,"Female"]
[]
[null,null,null,null,null,"E5",null,null,"Number of camp committee members who have attended the CCCM training:",null,null,null,null,null,null,null,null,null,null,null,null,null,null,null,null,null,null,null,null,null,null,null,null,null,null,null,null,null,null,null,null,null,null,null,null,null,null,null,{"$f":"INDEX(E5_01,RS)","v":2},null,null,null,{"$f":"INDEX(E5_02,RS)","v":{"$error":"#REF!"}}]
[]
[null,null,null,null,null,"E6",null,null,"Who of the following people participates actively in camp management committees or sub-committees: (tick √ all that apply ) "]
[null,null,null,null,null,null,null,null,null,null,{"$f":"IF(INDEX(E6_01,RS)=\"Yes\",\"X\",\"\")","v":""},null,"Elected camp residents",null,null,null,null,null,null,null,null,null,null,null,null,null,{"$f":"IF(INDEX(E6_02,RS)=\"Yes\",\"X\",\"\")","v":"X"},null,"Appointed camp residents",null,null,null,null,null,null,null,null,null,null,null,null,null,null,{"$f":"IF(INDEX(E6_03,RS)=\"Yes\",\"X\",\"\")","v":""},null,"Any camp resident",null,null,null,null,null,null,null,null,null,null,{"$f":"IF(INDEX(E6_04,RS)=\"Yes\",\"X\",\"\")","v":""},null,"Elders "]
[null,null,null,null,null,null,null,null,null,null,{"$f":"IF(INDEX(E6_05,RS)=\"Yes\",\"X\",\"\")","v":"X"},null,"Religious leaders",null,null,null,null,null,null,null,null,null,null,null,null,null,{"$f":"IF(INDEX(E6_06,RS)=\"Yes\",\"X\",\"\")","v":""},null,"Others",null,null,{"$f":"INDEX(E6_02,RS)","v":"Yes"},null,null,null,null,null,null,null,null,null,null,null,{"$f":"IF(INDEX(E6_07,RS)=\"Yes\",\"X\",\"\")","v":{"$error":"#REF!"}},null,"Don't know"]
[]
["F. Access to Services and Sectoral Needs",null,null,"Food",null,"COLLECT THIS INFORMATION FROM CAMP MANAGER/RESPONSIBLE"]
[null,null,null,"Access to services"]
[null,null,null,null,null,null,null,null,"Facility / Service",null,null,null,null,null,null,null,null,null,null,null,null,"a) Available within the camp?                    (tick √only one)",null,null,null,null,null,null,null,null,null,null,null,"b) Distance to nearest ACCESSIBLE and FUNCTIONING facility/service                   (answer at least one)",null,null,null,null,null,null,null,null,null,null,null,null,null,null,null,null,null,null,null,"c) Common mode of transport to nearest facility/service?                                                        (tick √only one)"]
[]
[]
[null,null,null,null,null,null,null,null,null,null,null,null,null,null,null,null,null,null,null,null,null,"Yes",null,null,null,null,"No",null,null,null,null,null,null,"Distance (miles)",null,null,null,null,null,null,null,null,"Time (minutes)",null,null,null,null,null,null,null,null,null,null,"Foot",null,null,null,null,"Motorb.",null,null,null,null,"Car",null,null,null,null,"Water"]
[null,null,null,null,null,"F1",null,null,"Regular market",null,null,null,null,null,null,null,null,null,null,null,null,{"$f":"IF(INDEX(F1_01,RS)=V$141,\"X\",\"\")","v":{"$error":"#REF!"}},null,null,null,null,{"$f":"IF(INDEX(F1_01,RS)=AA$141,\"X\",\"\")","v":{"$error":"#REF!"}},null,null,null,null,null,null,{"$f":"INDEX(F1_02,RS)","v":0},null,null,null,null,null,null,null,null,{"$f":"INDEX(F1_03,RS)","v":{"$error":"#REF!"}},null,null,null,null,null,null,null,null,null,null,{"$f":"IF(INDEX(F1_04,RS)=BB$141,\"X\",\"\")","v":{"$error":"#REF!"}},null,null,null,null,{"$f":"IF(INDEX(F1_04,RS)=BG$141,\"X\",\"\")","v":{"$error":"#REF!"}},null,null,null,null,{"$f":"IF(INDEX(F1_04,RS)=BL$141,\"X\",\"\")","v":{"$error":"#REF!"}},null,null,null,null,{"$f":"IF(INDEX(F1_04,RS)=BQ$141,\"X\",\"\")","v":{"$error":"#REF!"}}]
[null,null,null,null,null,"F2",null,null,"Drinking water source",null,null,null,null,null,null,null,null,null,null,null,null,{"$f":"IF(INDEX(F2_01,RS)=V$141,\"X\",\"\")","v":{"$error":"#REF!"}},null,null,null,null,{"$f":"IF(INDEX(F2_01,RS)=AA$141,\"X\",\"\")","v":{"$error":"#REF!"}},null,null,null,null,null,null,{"$f":"INDEX(F2_02,RS)","v":0},null,null,null,null,null,null,null,null,{"$f":"INDEX(F2_03,RS)","v":{"$error":"#REF!"}},null,null,null,null,null,null,null,null,null,null,{"$f":"IF(INDEX(F2_04,RS)=BB$141,\"X\",\"\")","v":{"$error":"#REF!"}},null,null,null,null,{"$f":"IF(INDEX(F2_04,RS)=BG$141,\"X\",\"\")","v":{"$error":"#REF!"}},null,null,null,null,{"$f":"IF(INDEX(F2_04,RS)=BL$141,\"X\",\"\")","v":{"$error":"#REF!"}},null,null,null,null,{"$f":"IF(INDEX(F2_04,RS)=BQ$141,\"X\",\"\")","v":{"$error":"#REF!"}}]
[null,null,null,null,null,"F3",null,null,"Health facility ",null,null,null,null,null,null,null,null,null,null,null,null,{"$f":"IF(INDEX(F3_01,RS)=V$141,\"X\",\"\")","v":{"$error":"#REF!"}},null,null,null,null,{"$f":"IF(INDEX(F3_01,RS)=AA$141,\"X\",\"\")","v":{"$error":"#REF!"}},null,null,null,null,null,null,{"$f":"INDEX(F3_02,RS)","v":0},null,null,null,null,null,null,null,null,{"$f":"INDEX(F3_03,RS)","v":{"$error":"#REF!"}},null,null,null,null,null,null,null,null,null,null,{"$f":"IF(INDEX(F3_04,RS)=BB$141,\"X\",\"\")","v":{"$error":"#REF!"}},null,null,null,null,{"$f":"IF(INDEX(F3_04,RS)=BG$141,\"X\",\"\")","v":{"$error":"#REF!"}},null,null,null,null,{"$f":"IF(INDEX(F3_04,RS)=BL$141,\"X\",\"\")","v":{"$error":"#REF!"}},null,null,null,null,{"$f":"IF(INDEX(F3_04,RS)=BQ$141,\"X\",\"\")","v":{"$error":"#REF!"}}]
[null,null,null,null,null,"F4",null,null,"Pre-school/nursery",null,null,null,null,null,null,null,null,null,null,null,null,{"$f":"IF(INDEX(F4_01,RS)=V$141,\"X\",\"\")","v":{"$error":"#REF!"}},null,null,null,null,{"$f":"IF(INDEX(F4_01,RS)=AA$141,\"X\",\"\")","v":{"$error":"#REF!"}},null,null,null,null,null,null,{"$f":"INDEX(F4_02,RS)","v":0},null,null,null,null,null,null,null,null,{"$f":"INDEX(F4_03,RS)","v":{"$error":"#REF!"}},null,null,null,null,null,null,null,null,null,null,{"$f":"IF(INDEX(F4_04,RS)=BB$141,\"X\",\"\")","v":{"$error":"#REF!"}},null,null,null,null,{"$f":"IF(INDEX(F4_04,RS)=BG$141,\"X\",\"\")","v":{"$error":"#REF!"}},null,null,null,null,{"$f":"IF(INDEX(F4_04,RS)=BL$141,\"X\",\"\")","v":{"$error":"#REF!"}},null,null,null,null,{"$f":"IF(INDEX(F4_04,RS)=BQ$141,\"X\",\"\")","v":{"$error":"#REF!"}}]
[null,null,null,null,null,"F5",null,null,"Primary school",null,null,null,null,null,null,null,null,null,null,null,null,{"$f":"IF(INDEX(F5_01,RS)=V$141,\"X\",\"\")","v":{"$error":"#REF!"}},null,null,null,null,{"$f":"IF(INDEX(F5_01,RS)=AA$141,\"X\",\"\")","v":{"$error":"#REF!"}},null,null,null,null,null,null,{"$f":"INDEX(F5_02,RS)","v":0},null,null,null,null,null,null,null,null,{"$f":"INDEX(F5_03,RS)","v":{"$error":"#REF!"}},null,null,null,null,null,null,null,null,null,null,{"$f":"IF(INDEX(F5_04,RS)=BB$141,\"X\",\"\")","v":{"$error":"#REF!"}},null,null,null,null,{"$f":"IF(INDEX(F5_04,RS)=BG$141,\"X\",\"\")","v":{"$error":"#REF!"}},null,null,null,null,{"$f":"IF(INDEX(F5_04,RS)=BL$141,\"X\",\"\")","v":{"$error":"#REF!"}},null,null,null,null,{"$f":"IF(INDEX(F5_04,RS)=BQ$141,\"X\",\"\")","v":{"$error":"#REF!"}}]
[null,null,null,null,null,"F6",null,null,"Middle school",null,null,null,null,null,null,null,null,null,null,null,null,{"$f":"IF(INDEX(F6_01,RS)=V$141,\"X\",\"\")","v":{"$error":"#REF!"}},null,null,null,null,{"$f":"IF(INDEX(F6_01,RS)=AA$141,\"X\",\"\")","v":{"$error":"#REF!"}},null,null,null,null,null,null,{"$f":"INDEX(F6_02,RS)","v":{"$error":"#REF!"}},null,null,null,null,null,null,null,null,{"$f":"INDEX(F6_03,RS)","v":{"$error":"#REF!"}},null,null,null,null,null,null,null,null,null,null,{"$f":"IF(INDEX(F6_04,RS)=BB$141,\"X\",\"\")","v":{"$error":"#REF!"}},null,null,null,null,{"$f":"IF(INDEX(F6_04,RS)=BG$141,\"X\",\"\")","v":{"$error":"#REF!"}},null,null,null,null,{"$f":"IF(INDEX(F6_04,RS)=BL$141,\"X\",\"\")","v":{"$error":"#REF!"}},null,null,null,null,{"$f":"IF(INDEX(F6_04,RS)=BQ$141,\"X\",\"\")","v":{"$error":"#REF!"}}]
[null,null,null,null,null,"F7",null,null,"High school",null,null,null,null,null,null,null,null,null,null,null,null,{"$f":"IF(INDEX(F7_01,RS)=V$141,\"X\",\"\")","v":{"$error":"#REF!"}},null,null,null,null,{"$f":"IF(INDEX(F7_01,RS)=AA$141,\"X\",\"\")","v":{"$error":"#REF!"}},null,null,null,null,null,null,{"$f":"INDEX(F7_02,RS)","v":{"$error":"#REF!"}},null,null,null,null,null,null,null,null,{"$f":"INDEX(F7_03,RS)","v":{"$error":"#REF!"}},null,null,null,null,null,null,null,null,null,null,{"$f":"IF(INDEX(F7_04,RS)=BB$141,\"X\",\"\")","v":{"$error":"#REF!"}},null,null,null,null,{"$f":"IF(INDEX(F7_04,RS)=BG$141,\"X\",\"\")","v":{"$error":"#REF!"}},null,null,null,null,{"$f":"IF(INDEX(F7_04,RS)=BL$141,\"X\",\"\")","v":{"$error":"#REF!"}},null,null,null,null,{"$f":"IF(INDEX(F7_04,RS)=BQ$141,\"X\",\"\")","v":{"$error":"#REF!"}}]
[]
[null,null,null,"Food"]
[null,null,null,null,null,"F8",null,null,"What is the main type of kitchen(s) for camp residents:",null,null,null,null,null,null,null,null,null,null,null,null,null,null,null,null,null,null,null,null,null,null,null,null,null,null,null,null,null,null,{"$f":"IF(INDEX(F8_01,RS)=AP151,\"X\",\"\")","v":"X"},null,"Individual",null,null,null,null,null,null,null,null,{"$f":"IF(INDEX(F8_01,RS)=BA151,\"X\",\"\")","v":""},null,"Communal",null,null,null,null,null,null,null,null,{"$f":"IF(INDEX(F8_01,RS)=BL151,\"X\",\"\")","v":""},null,"Mixed"]
[null,null,null,null,null,null,null,null,"(verify by observation; tick √ one)"]
[]
[null,null,null,null,null,"F9",null,null,"Is there a proper storage facility for food in the camp?",null,null,null,null,null,null,null,null,null,null,null,null,null,null,null,null,null,null,null,null,null,null,null,null,null,null,null,null,null,null,null,null,null,null,{"$f":"IF(INDEX(F9_01,RS)=AT154,\"X\",\"\")","v":"X"},null,"Yes",null,null,null,null,{"$f":"IF(INDEX(F9_01,RS)=BA154,\"X\",\"\")","v":""},null,"No"]
[]
[null,null,null,"Shelter"]
[null,null,null,null,null,"F10",null,null,"What is the main type of shelter for camp residents:",null,null,null,null,null,null,null,null,null,null,null,null,null,null,null,null,null,null,null,null,null,null,null,null,null,null,null,null,{"$f":"IF(INDEX(F10_01,RS)=AN157,\"X\",\"\")","v":""},null,"Open space (without roof/wall)",null,null,null,null,null,null,null,null,null,null,null,null,null,null,null,null,null,{"$f":"IF(INDEX(F10_01,RS)=BH157,\"X\",\"\")","v":""},null,"Make-shift shelters "]
[null,null,null,null,null,null,null,null,"(verify by observation; tick √ one)",null,null,null,null,null,null,null,null,null,null,null,null,null,null,null,null,null,null,null,null,null,null,null,null,null,null,null,null,{"$f":"IF(INDEX(F10_01,RS)=AN158,\"X\",\"\")","v":""},null,"Community/religious building",null,null,null,null,null,null,null,null,null,null,null,null,null,null,null,null,null,{"$f":"IF(INDEX(F10_01,RS)=BH158,\"X\",\"\")","v":"X"},null,"Solid shelters"]
[]
[null,null,null,null,null,null,null,null,"If majority of IDPs live in make-shift, community buildings or solid shelters, ask the following questions (F11 to F13):"]
[null,null,null,null,null,"F11",null,null,"What is the approximate proportion of households sharing shelter? ",null,null,null,null,null,null,null,null,null,null,null,null,null,null,null,null,null,null,null,null,null,null,null,null,null,null,null,null,null,null,null,null,null,null,{"$f":"IF(INDEX(F11_01,RS)=AT161,\"X\",\"\")","v":""},null,"0%",null,null,null,null,{"$f":"IF(INDEX(F11_01,RS)=BA161,\"X\",\"\")","v":""},null,"< 25%",null,null,null,null,{"$f":"IF(INDEX(F11_01,RS)=BH161,\"X\",\"\")","v":""},null,"25-50%"]
[null,null,null,null,null,null,null,null," (tick √ only one)",null,null,null,null,null,null,null,null,null,null,null,null,null,null,null,null,null,null,null,null,null,null,null,null,null,null,null,null,null,null,null,null,null,null,{"$f":"IF(INDEX(F11_01,RS)=AT162,\"X\",\"\")","v":""},null,"51-75%",null,null,null,null,{"$f":"IF(INDEX(F11_01,RS)=BA162,\"X\",\"\")","v":""},null,"76-95%",null,null,null,null,{"$f":"IF(INDEX(F11_01,RS)=BH162,\"X\",\"\")","v":"X"},null,"96-100%"]
[]
[null,null,null,null,null,"F12",null,null,"What is the approximate proportion of households without shelter? ",null,null,null,null,null,null,null,null,null,null,null,null,null,null,null,null,null,null,null,null,null,null,null,null,null,null,null,null,null,null,null,null,null,null,{"$f":"IF(INDEX(F12_01,RS)=AT164,\"X\",\"\")","v":"X"},null,"0%",null,null,null,null,{"$f":"IF(INDEX(F12_01,RS)=BA164,\"X\",\"\")","v":""},null,"< 25%",null,null,null,null,{"$f":"IF(INDEX(F12_01,RS)=BH164,\"X\",\"\")","v":""},null,"25-50%"]
[null,null,null,null,null,null,null,null," (tick √ only one)",null,null,null,null,null,null,null,null,null,null,null,null,null,null,null,null,null,null,null,null,null,null,null,null,null,null,null,null,null,null,null,null,null,null,{"$f":"IF(INDEX(F12_01,RS)=AT165,\"X\",\"\")","v":""},null,"51-75%",null,null,null,null,{"$f":"IF(INDEX(F12_01,RS)=BA165,\"X\",\"\")","v":""},null,"76-95%",null,null,null,null,{"$f":"IF(INDEX(F12_01,RS)=BH165,\"X\",\"\")","v":""},null,"96-100%"]
[]
[null,null,null,null,null,"F13",null,null,"Do shelters usually have partitioned rooms for sleeping? ",null,null,null,null,null,null,null,null,null,null,null,null,null,null,null,null,null,null,null,null,null,null,null,null,null,null,null,null,null,{"$f":"IF(INDEX(F13_01,RS)=AO167,\"X\",\"\")","v":"X"},null,"Yes",null,null,null,null,{"$f":"IF(INDEX(F13_01,RS)=AV167,\"X\",\"\")","v":""},null,"No"]
[]
[null,null,null,"WASH"]
[null,null,null,null,null,"F14",null,null,"What is the main source of drinking water for camp residents?",null,null,null,null,null,null,null,null,null,null,null,null,null,null,null,null,null,null,null,null,null,null,null,null,null,null,null,null,null,null,null,null,{"$f":"IF(INDEX(F14_01,RS)=AR170,\"X\",\"\")","v":"X"},null,"Well",null,null,null,null,null,null,null,null,null,null,null,{"$f":"IF(INDEX(F14_01,RS)=BF170,\"X\",\"\")","v":""},null,"Rivers, springs, etc."]
[null,null,null,null,null,null,null,null,"(verify by observation; tick √ one)",null,null,null,null,null,null,null,null,null,null,null,null,null,null,null,null,null,null,null,null,null,null,null,null,null,null,null,null,null,null,null,null,{"$f":"IF(INDEX(F14_01,RS)=AR171,\"X\",\"\")","v":""},null,"Borehole/hand pump",null,null,null,null,null,null,null,null,null,null,null,{"$f":"IF(INDEX(F14_01,RS)=BF171,\"X\",\"\")","v":""},null,"Other",null,null,{"$f":"INDEX(F14_02,RS)","v":{"$error":"#REF!"}}]
[]
[null,null,null,null,null,"F15",null,null,"Is the daily amount of drinking water sufficient for all camp residents\"?",null,null,null,null,null,null,null,null,null,null,null,null,null,null,null,null,null,null,null,null,null,null,null,null,null,null,null,null,null,null,null,null,null,null,null,null,{"$f":"IF(INDEX(F15_01,RS)=AV173,\"X\",\"\")","v":""},null,"Yes",null,null,null,null,{"$f":"IF(INDEX(F15_01,RS)=BC173,\"X\",\"\")","v":"X"},null,"No"]
[null,null,null,null,null,null,null,null,null,null,null,null,null,null,null,null,null,null,null,null,null,null,null,null,null,null,null,null,null,null,null,null,null,"For men",null,null,null,null,null,"For women",null,null,null,null,null,"Mixed"]
[null,null,null,null,null,"F16",null,null,"Total number of functioning latrines in camp:",null,null,null,null,null,null,null,null,null,null,null,null,null,null,null,null,null,null,null,null,null,null,null,null,{"$f":"INDEX(F16_01,RS)","v":0},null,null,null,null,null,{"$f":"INDEX(F16_02,RS)","v":4},null,null,null,null,null,{"$f":"INDEX(F16_03,RS)","v":0}]
[null,null,null,null,null,"F17",null,null,"Total number of functioning fly-proof latrines:",null,null,null,null,null,null,null,null,null,null,null,null,null,null,null,null,null,null,null,null,null,null,null,null,{"$f":"INDEX(F17_01,RS)","v":{"$error":"#REF!"}},null,null,null,null,null,{"$f":"INDEX(F17_02,RS)","v":{"$error":"#REF!"}},null,null,null,null,null,{"$f":"INDEX(F17_03,RS)","v":{"$error":"#REF!"}}]
[]
[null,null,null,null,null,"F18",null,null,"Are there separate bathing areas for men and women?",null,null,null,null,null,null,null,null,null,null,null,null,null,null,null,null,null,null,null,null,null,null,null,null,null,null,null,null,{"$f":"IF(INDEX(F18_01,RS)=AN178,\"X\",\"\")","v":""},null,"Yes",null,null,null,null,{"$f":"IF(INDEX(F18_01,RS)=AU178,\"X\",\"\")","v":"X"},null,"No"]
[]
[null,null,null,null,null,"F19",null,null,"Where/how is camp waste generally ",null,null,null,null,null,null,null,null,null,null,null,null,null,null,null,null,null,null,{"$f":"IF(INDEX(F19_01,RS)=AD180,\"X\",\"\")","v":""},null,"Common identified waste dump inside camp",null,null,null,null,null,null,null,null,null,null,null,null,null,null,null,null,null,null,null,null,null,null,{"$f":"IF(INDEX(F19_01,RS)=BC180,\"X\",\"\")","v":"X"},null,"Identified waste dump outside camp"]
[null,null,null,null,null,null,null,null,"being disposed of? (tick √ only one)",null,null,null,null,null,null,null,null,null,null,null,null,null,null,null,null,null,null,{"$f":"IF(INDEX(F19_01,RS)=AD181,\"X\",\"\")","v":""},null,"Dumped everywhere inside the camp",null,null,null,null,null,null,null,null,null,null,null,null,null,null,null,null,null,null,null,null,null,null,{"$f":"IF(INDEX(F19_01,RS)=BC181,\"X\",\"\")","v":""},null,"Is getting burnt"]
[]
[null,null,null,"Health "]
[null,null,null,null,null,"F20",null,null,"What is the type of the nearest accessible functioning",null,null,null,null,null,null,null,null,null,null,null,null,null,null,null,null,null,null,null,null,null,null,null,null,null,null,null,{"$f":"IF(INDEX(F20_01,RS)=AM184,\"X\",\"\")","v":""},null,"Hospital",null,null,null,null,null,null,null,null,null,{"$f":"IF(INDEX(F20_01,RS)=AY184,\"X\",\"\")","v":"X"},null,"Clinic",null,null,null,null,null,null,null,null,{"$f":"IF(INDEX(F20_01,RS)=BJ184,\"X\",\"\")","v":""},null,"Rural centre"]
[null,null,null,null,null,null,null,null,"health facility for camp residents? (tick √ only one) ",null,null,null,null,null,null,null,null,null,null,null,null,null,null,null,null,null,null,null,null,null,null,null,null,null,null,null,{"$f":"IF(INDEX(F20_01,RS)=AM185,\"X\",\"\")","v":""},null,"Rural sub-centre",null,null,null,null,null,null,null,null,null,{"$f":"IF(INDEX(F20_01,RS)=AY185,\"X\",\"\")","v":""},null,"Referral centre",null,null,null,null,null,null,null,null,{"$f":"IF(INDEX(F20_01,RS)=BJ185,\"X\",\"\")","v":""},null,"Other",null,null,{"$f":"INDEX(F20_02,RS)","v":0}]
[]
[null,null,null,null,null,"F21",null,null,"Which of the following staff or health services are regularly available  for camp residents:"]
[null,null,null,null,null,null,null,null,"(tick √ all that apply ) ",null,null,null,null,null,null,null,null,null,null,{"$f":"IF(INDEX(F21_01,RS)=\"Yes\",\"X\",\"\")","v":""},null,"Doctor(s)",null,null,null,null,null,null,null,{"$f":"IF(INDEX(F21_02,RS)=\"Yes\",\"X\",\"\")","v":"X"},null,"Nurse(s)",null,null,null,null,null,null,null,null,null,null,null,null,{"$f":"IF(INDEX(F21_03,RS)=\"Yes\",\"X\",\"\")","v":"X"},null,"Mid-wives",null,null,null,null,null,null,null,null,null,null,{"$f":"IF(INDEX(F21_04,RS)=\"Yes\",\"X\",\"\")","v":"X"},null,"Community worker(s)"]
[null,null,null,null,null,null,null,null,null,null,null,null,null,null,null,null,null,null,null,{"$f":"IF(INDEX(F21_05,RS)=\"Yes\",\"X\",\"\")","v":""},null,"Vaccination",null,null,null,null,null,null,null,{"$f":"IF(INDEX(F21_06,RS)=\"Yes\",\"X\",\"\")","v":"X"},null,"Preventive health care",null,null,null,null,null,null,null,null,null,null,null,null,{"$f":"IF(INDEX(F21_07,RS)=\"Yes\",\"X\",\"\")","v":"X"},null,"Pre&Post natal care",null,null,null,null,null,null,null,null,null,null,{"$f":"IF(INDEX(F21_08,RS)=\"Yes\",\"X\",\"\")","v":"X"},null,"Reproductive health care "]
[null,null,null,null,null,null,null,null,null,null,null,null,null,null,null,null,null,null,null,{"$f":"IF(INDEX(F21_09,RS)=\"Yes\",\"X\",\"\")","v":"X"},null,"Psychosocial support services ",null,null,null,null,null,null,null,null,null,null,null,null,null,null,null,null,null,null,null,null,null,null,{"$f":"IF(INDEX(F21_10,RS)=\"Yes\",\"X\",\"\")","v":""},null,"Don’t know"]
[]
[null,null,null,"Education"]
[null,null,null,null,null,"F22",null,null,"What is the approximate proportion of FEMALE children ",null,null,null,null,null,null,null,null,null,null,null,null,null,null,null,null,null,null,null,null,null,null,null,null,null,null,null,null,null,null,null,null,null,{"$f":"IF(INDEX(F22_01,RS)=AS193,\"X\",\"\")","v":""},null,"0%",null,null,null,null,{"$f":"IF(INDEX(F22_01,RS)=AZ193,\"X\",\"\")","v":""},null,"< 25%",null,null,null,null,{"$f":"IF(INDEX(F22_01,RS)=BG193,\"X\",\"\")","v":""},null,"25-50%"]
[null,null,null,null,null,null,null,null,"(5 to 17 years old) regularly attending school? (tick √ only one)",null,null,null,null,null,null,null,null,null,null,null,null,null,null,null,null,null,null,null,null,null,null,null,null,null,null,null,null,null,null,null,null,null,{"$f":"IF(INDEX(F22_01,RS)=AS194,\"X\",\"\")","v":""},null,"51-75%",null,null,null,null,{"$f":"IF(INDEX(F22_01,RS)=AZ194,\"X\",\"\")","v":"X"},null,"76-95%",null,null,null,null,{"$f":"IF(INDEX(F22_01,RS)=BG194,\"X\",\"\")","v":""},null,"96-100%"]
[]
[null,null,null,null,null,"F23",null,null,"What is the approximate proportion of MALE children",null,null,null,null,null,null,null,null,null,null,null,null,null,null,null,null,null,null,null,null,null,null,null,null,null,null,null,null,null,null,null,null,null,{"$f":"IF(INDEX(F23_01,RS)=AS196,\"X\",\"\")","v":""},null,"0%",null,null,null,null,{"$f":"IF(INDEX(F23_01,RS)=AZ196,\"X\",\"\")","v":""},null,"< 25%",null,null,null,null,{"$f":"IF(INDEX(F23_01,RS)=BG196,\"X\",\"\")","v":""},null,"25-50%"]
[null,null,null,null,null,null,null,null,"(5 to 17 years old) regularly attending school? (tick √ only one)",null,null,null,null,null,null,null,null,null,null,null,null,null,null,null,null,null,null,null,null,null,null,null,null,null,null,null,null,null,null,null,null,null,{"$f":"IF(INDEX(F23_01,RS)=AS197,\"X\",\"\")","v":""},null,"51-75%",null,null,null,null,{"$f":"IF(INDEX(F23_01,RS)=AZ197,\"X\",\"\")","v":""},null,"76-95%",null,null,null,null,{"$f":"IF(INDEX(F23_01,RS)=BG197,\"X\",\"\")","v":"X"},null,"96-100%"]
[]
["G. Livelihoods",null,null,null,null,"COLLECT THIS INFORMATION FROM CAMP MANAGER/RESPONSIBLE"]
[null,null,null,null,null,"G1",null,null,"CURRENTLY, What are the TWO MAIN livelihoods activities for MALE camp residents?: (tick √ only 2) "]
[null,null,null,null,null,null,null,null,{"$f":"CONCATENATE(IF(INDEX(G1_01,RS)=K201,\"X\",\"\"),IF(INDEX(G1_03,RS)=K201,\"X\",\"\"))","v":""},null,"Farming",null,null,null,null,null,null,null,null,null,null,null,null,{"$f":"CONCATENATE(IF(INDEX(G1_01,RS)=Z201,\"X\",\"\"),IF(INDEX(G1_03,RS)=Z201,\"X\",\"\"))","v":""},null,"Fishing",null,null,null,null,null,null,null,null,null,null,null,null,{"$f":"CONCATENATE(IF(INDEX(G1_01,RS)=AO201,\"X\",\"\"),IF(INDEX(G1_03,RS)=AO201,\"X\",\"\"))","v":""},null,"Livestock",null,null,null,null,null,null,{"$f":"CONCATENATE(IF(INDEX(G1_01,RS)=AX201,\"X\",\"\"),IF(INDEX(G1_03,RS)=AX201,\"X\",\"\"))","v":""},null,"Manufacturing (food processing)",null,null,null,null,null,null,null,null,null,null,null,null,null,null,null,null,{"$f":"CONCATENATE(IF(INDEX(G1_01,RS)=BQ201,\"X\",\"\"),IF(INDEX(G1_03,RS)=BQ201,\"X\",\"\"))","v":"X"},null,"Mining"]
[null,null,null,null,null,null,null,null,{"$f":"CONCATENATE(IF(INDEX(G1_01,RS)=K202,\"X\",\"\"),IF(INDEX(G1_03,RS)=K202,\"X\",\"\"))","v":""},null,"Trade (buying and selling)",null,null,null,null,null,null,null,null,null,null,null,null,{"$f":"CONCATENATE(IF(INDEX(G1_01,RS)=Z202,\"X\",\"\"),IF(INDEX(G1_03,RS)=Z202,\"X\",\"\"))","v":""},null,"Manufacturing (non-food)",null,null,null,null,null,null,null,null,null,null,null,null,{"$f":"CONCATENATE(IF(INDEX(G1_01,RS)=AO202,\"X\",\"\"),IF(INDEX(G1_03,RS)=AO202,\"X\",\"\"))","v":""},null,"Handicrafts",null,null,null,null,null,null,{"$f":"CONCATENATE(IF(INDEX(G1_01,RS)=AX202,\"X\",\"\"),IF(INDEX(G1_03,RS)=AX202,\"X\",\"\"))","v":"X"},null,"Other",null,null,{"$f":"CONCATENATE(INDEX(G1_02,RS),INDEX(G1_04,RS))","v":{"$error":"#REF!"}},null,null,null,null,null,null,null,null,null,null,null,null,null,{"$f":"CONCATENATE(IF(INDEX(G1_01,RS)=BQ202,\"X\",\"\"),IF(INDEX(G1_03,RS)=BQ202,\"X\",\"\"))","v":""},null,"None"]
[]
[null,null,null,null,null,"G2",null,null,"BEFORE DISPLACEMENT, what were the TWO MAIN livelihoods activities for MALE camp residents?: (tick √ only 2) "]
[null,null,null,null,null,null,null,null,{"$f":"CONCATENATE(IF(INDEX(G2_01,RS)=K205,\"X\",\"\"),IF(INDEX(G2_03,RS)=K205,\"X\",\"\"))","v":"X"},null,"Farming",null,null,null,null,null,null,null,null,null,null,null,null,{"$f":"CONCATENATE(IF(INDEX(G2_01,RS)=Z205,\"X\",\"\"),IF(INDEX(G2_03,RS)=Z205,\"X\",\"\"))","v":""},null,"Fishing",null,null,null,null,null,null,null,null,null,null,null,null,{"$f":"CONCATENATE(IF(INDEX(G2_01,RS)=AO205,\"X\",\"\"),IF(INDEX(G2_03,RS)=AO205,\"X\",\"\"))","v":""},null,"Livestock",null,null,null,null,null,null,{"$f":"CONCATENATE(IF(INDEX(G2_01,RS)=AX205,\"X\",\"\"),IF(INDEX(G2_03,RS)=AX205,\"X\",\"\"))","v":""},null,"Manufacturing (food processing)",null,null,null,null,null,null,null,null,null,null,null,null,null,null,null,null,{"$f":"CONCATENATE(IF(INDEX(G2_01,RS)=BQ205,\"X\",\"\"),IF(INDEX(G2_03,RS)=BQ205,\"X\",\"\"))","v":"X"},null,"Mining"]
[null,null,null,null,null,null,null,null,{"$f":"CONCATENATE(IF(INDEX(G2_01,RS)=K206,\"X\",\"\"),IF(INDEX(G2_03,RS)=K206,\"X\",\"\"))","v":""},null,"Trade (buying and selling)",null,null,null,null,null,null,null,null,null,null,null,null,{"$f":"CONCATENATE(IF(INDEX(G2_01,RS)=Z206,\"X\",\"\"),IF(INDEX(G2_03,RS)=Z206,\"X\",\"\"))","v":""},null,"Manufacturing (non-food)",null,null,null,null,null,null,null,null,null,null,null,null,{"$f":"CONCATENATE(IF(INDEX(G2_01,RS)=AO206,\"X\",\"\"),IF(INDEX(G2_03,RS)=AO206,\"X\",\"\"))","v":""},null,"Handicrafts",null,null,null,null,null,null,{"$f":"CONCATENATE(IF(INDEX(G2_01,RS)=AX206,\"X\",\"\"),IF(INDEX(G2_03,RS)=AX206,\"X\",\"\"))","v":""},null,"Other",null,null,{"$f":"CONCATENATE(INDEX(G2_02,RS),INDEX(G2_04,RS))","v":{"$error":"#REF!"}},null,null,null,null,null,null,null,null,null,null,null,null,null,{"$f":"CONCATENATE(IF(INDEX(G2_01,RS)=BQ206,\"X\",\"\"),IF(INDEX(G2_03,RS)=BQ206,\"X\",\"\"))","v":""},null,"None"]
[]
[null,null,null,null,null,"G3",null,null,"CURRENTLY, What are the TWO MAIN livelihoods activities for FEMALE camp residents?: (tick √ only 2)"]
[null,null,null,null,null,null,null,null,{"$f":"CONCATENATE(IF(INDEX(G3_01,RS)=K209,\"X\",\"\"),IF(INDEX(G3_03,RS)=K209,\"X\",\"\"))","v":""},null,"Farming",null,null,null,null,null,null,null,null,null,null,null,null,{"$f":"CONCATENATE(IF(INDEX(G3_01,RS)=Z209,\"X\",\"\"),IF(INDEX(G3_03,RS)=Z209,\"X\",\"\"))","v":""},null,"Fishing",null,null,null,null,null,null,null,null,null,null,null,null,{"$f":"CONCATENATE(IF(INDEX(G3_01,RS)=AO209,\"X\",\"\"),IF(INDEX(G3_03,RS)=AO209,\"X\",\"\"))","v":"X"},null,"Livestock",null,null,null,null,null,null,{"$f":"CONCATENATE(IF(INDEX(G3_01,RS)=AX209,\"X\",\"\"),IF(INDEX(G3_03,RS)=AX209,\"X\",\"\"))","v":""},null,"Manufacturing (food processing)",null,null,null,null,null,null,null,null,null,null,null,null,null,null,null,null,{"$f":"CONCATENATE(IF(INDEX(G3_01,RS)=BQ209,\"X\",\"\"),IF(INDEX(G3_03,RS)=BQ209,\"X\",\"\"))","v":""},null,"Mining"]
[null,null,null,null,null,null,null,null,{"$f":"CONCATENATE(IF(INDEX(G3_01,RS)=K210,\"X\",\"\"),IF(INDEX(G3_03,RS)=K210,\"X\",\"\"))","v":""},null,"Trade (buying and selling)",null,null,null,null,null,null,null,null,null,null,null,null,{"$f":"CONCATENATE(IF(INDEX(G3_01,RS)=Z210,\"X\",\"\"),IF(INDEX(G3_03,RS)=Z210,\"X\",\"\"))","v":""},null,"Manufacturing (non-food)",null,null,null,null,null,null,null,null,null,null,null,null,{"$f":"CONCATENATE(IF(INDEX(G3_01,RS)=AO210,\"X\",\"\"),IF(INDEX(G3_03,RS)=AO210,\"X\",\"\"))","v":"X"},null,"Handicrafts",null,null,null,null,null,null,{"$f":"CONCATENATE(IF(INDEX(G3_01,RS)=AX210,\"X\",\"\"),IF(INDEX(G3_03,RS)=AX210,\"X\",\"\"))","v":""},null,"Other",null,null,{"$f":"CONCATENATE(INDEX(G3_02,RS),INDEX(G3_04,RS))","v":{"$error":"#REF!"}},null,null,null,null,null,null,null,null,null,null,null,null,null,{"$f":"CONCATENATE(IF(INDEX(G3_01,RS)=BQ210,\"X\",\"\"),IF(INDEX(G3_03,RS)=BQ210,\"X\",\"\"))","v":""},null,"None"]
[]
[null,null,null,null,null,"G4",null,null,"BEFORE DISPLACEMENT, What were the TWO MAIN livelihoods activities for FEMALE camp residents?: (tick √ only 2) "]
[null,null,null,null,null,null,null,null,{"$f":"CONCATENATE(IF(INDEX(G4_01,RS)=K213,\"X\",\"\"),IF(INDEX(G4_03,RS)=K213,\"X\",\"\"))","v":"X"},null,"Farming",null,null,null,null,null,null,null,null,null,null,null,null,{"$f":"CONCATENATE(IF(INDEX(G4_01,RS)=Z213,\"X\",\"\"),IF(INDEX(G4_03,RS)=Z213,\"X\",\"\"))","v":""},null,"Fishing",null,null,null,null,null,null,null,null,null,null,null,null,{"$f":"CONCATENATE(IF(INDEX(G4_01,RS)=AO213,\"X\",\"\"),IF(INDEX(G4_03,RS)=AO213,\"X\",\"\"))","v":"X"},null,"Livestock",null,null,null,null,null,null,{"$f":"CONCATENATE(IF(INDEX(G4_01,RS)=AX213,\"X\",\"\"),IF(INDEX(G4_03,RS)=AX213,\"X\",\"\"))","v":""},null,"Manufacturing (food processing)",null,null,null,null,null,null,null,null,null,null,null,null,null,null,null,null,{"$f":"CONCATENATE(IF(INDEX(G4_01,RS)=BQ213,\"X\",\"\"),IF(INDEX(G4_03,RS)=BQ213,\"X\",\"\"))","v":""},null,"Mining"]
[null,null,null,null,null,null,null,null,{"$f":"CONCATENATE(IF(INDEX(G4_01,RS)=K214,\"X\",\"\"),IF(INDEX(G4_03,RS)=K214,\"X\",\"\"))","v":""},null,"Trade (buying and selling)",null,null,null,null,null,null,null,null,null,null,null,null,{"$f":"CONCATENATE(IF(INDEX(G4_01,RS)=Z214,\"X\",\"\"),IF(INDEX(G4_03,RS)=Z214,\"X\",\"\"))","v":""},null,"Manufacturing (non-food)",null,null,null,null,null,null,null,null,null,null,null,null,{"$f":"CONCATENATE(IF(INDEX(G4_01,RS)=AO214,\"X\",\"\"),IF(INDEX(G4_03,RS)=AO214,\"X\",\"\"))","v":""},null,"Handicrafts",null,null,null,null,null,null,{"$f":"CONCATENATE(IF(INDEX(G4_01,RS)=AX214,\"X\",\"\"),IF(INDEX(G4_03,RS)=AX214,\"X\",\"\"))","v":""},null,"Other",null,null,{"$f":"CONCATENATE(INDEX(G4_02,RS),INDEX(G4_04,RS))","v":{"$error":"#REF!"}},null,null,null,null,null,null,null,null,null,null,null,null,null,{"$f":"CONCATENATE(IF(INDEX(G4_01,RS)=BQ214,\"X\",\"\"),IF(INDEX(G4_03,RS)=BQ214,\"X\",\"\"))","v":""},null,"None"]
[]
["H. Gaps identified by the camp managers and residents",null,null,null,null,"COLLECT THIS INFORMATION FIRST FROM THE CAMP MANAGER/RESPONSIBLE AND THEN FROM CAMP RESIDENTS"]
[null,null,null,null,null,null,null,"Please ask the respondents SEPARATELY (camp manager/responsible and female IDP) to list the THREE MOST important needs for the "]
[null,null,null,null,null,null,null,"community, in order of priority. Identify those three needs in the list below (or use the space for 'Others' if needed), and record "]
[null,null,null,null,null,null,null,"the corresponding priority: 1 = Highest, 2 = Medium, 3= Lowest. There should be ONLY THREE priorities identified  by each key informant."]
[null,null,null,null,null,null,null,"Specific Need",null,null,null,null,null,null,null,null,null,null,null,null,null,null,null,"Priorities by ",null,null,null,null,null,null,null,"Priorities by ",null,null,null,null,null,null,null,"Explanations / Observations (from camp manger, residents "]
[null,null,null,null,null,null,null,null,null,null,null,null,null,null,null,null,null,null,null,null,null,null,null,"Camp Managers",null,null,null,null,null,null,null,"Camp Residents",null,null,null,null,null,null,null,"or interviewer)"]
[null,null,null,null,null,null,null,null,null,null,null,null,null,null,null,null,null,null,null,null,null,null,null,"(Write 1-3)",null,null,null,null,null,null,null,"(Write 1-3)"]
[null,null,null,null,null,"H1",null,"Basic Food                                       ",null,null,null,null,null,null,null,null,null,null,null,null,null,null,null,{"$f":"CONCATENATE(IF(INDEX(H1_01,RS)=H223,1,\"\"),IF(INDEX(H1_11,RS)=H223,2,\"\"),IF(INDEX(H1_21,RS)=H223,3,\"\"))","v":""},null,null,null,null,null,null,null,{"$f":"CONCATENATE(IF(INDEX(H1_03,RS)=H223,1,\"\"),IF(INDEX(H1_13,RS)=H223,2,\"\"),IF(INDEX(H1_23,RS)=H223,3,\"\"))","v":""},null,null,null,null,null,null,null,{"$f":"CONCATENATE(IF(INDEX(H1_01,RS)=H223,INDEX(H1_05,RS),\"\"),IF(INDEX(H1_11,RS)=H223,INDEX(H1_15,RS),\"\"),IF(INDEX(H1_21,RS)=H223,INDEX(H1_25,RS),\"\"),IF(INDEX(H1_03,RS)=H223,INDEX(H1_05,RS),\"\"),IF(INDEX(H1_13,RS)=H223,INDEX(H1_15,RS),\"\"),IF(INDEX(H1_23,RS)=H223,INDEX(H1_25,RS),\"\"))","v":""}]
[null,null,null,null,null,"H2",null,"Complementary Food                                 ",null,null,null,null,null,null,null,null,null,null,null,null,null,null,null,"",null,null,null,null,null,null,null,"1",null,null,null,null,null,null,null,{"$error":"#REF!"}]
[null,null,null,null,null,"H3",null,"Firewood / fuel                                                                      ",null,null,null,null,null,null,null,null,null,null,null,null,null,null,null,"",null,null,null,null,null,null,null,"",null,null,null,null,null,null,null,""]
[null,null,null,null,null,"H4",null,"Individual shelter/houses             ",null,null,null,null,null,null,null,null,null,null,null,null,null,null,null,"",null,null,null,null,null,null,null,"",null,null,null,null,null,null,null,""]
[null,null,null,null,null,"H5",null,"Communal building                      ",null,null,null,null,null,null,null,null,null,null,null,null,null,null,null,"",null,null,null,null,null,null,null,"",null,null,null,null,null,null,null,""]
[null,null,null,null,null,"H6",null,"Partitions within shelters",null,null,null,null,null,null,null,null,null,null,null,null,null,null,null,"",null,null,null,null,null,null,null,"",null,null,null,null,null,null,null,""]
[null,null,null,null,null,"H7",null,"Blankets/Winter Clothing                                         ",null,null,null,null,null,null,null,null,null,null,null,null,null,null,null,"",null,null,null,null,null,null,null,"",null,null,null,null,null,null,null,""]
[null,null,null,null,null,"H8",null,"Hygiene kits                                         ",null,null,null,null,null,null,null,null,null,null,null,null,null,null,null,"",null,null,null,null,null,null,null,"2",null,null,null,null,null,null,null,{"$error":"#REF!"}]
[null,null,null,null,null,"H9",null,"Kitchen sets                                         ",null,null,null,null,null,null,null,null,null,null,null,null,null,null,null,"",null,null,null,null,null,null,null,"",null,null,null,null,null,null,null,""]
[null,null,null,null,null,"H10",null,"Women NFIs (sanitary pads, underwear, etc.)",null,null,null,null,null,null,null,null,null,null,null,null,null,null,null,"",null,null,null,null,null,null,null,"",null,null,null,null,null,null,null,""]
[null,null,null,null,null,"H11",null,"Health facility / Clinic                                         ",null,null,null,null,null,null,null,null,null,null,null,null,null,null,null,"",null,null,null,null,null,null,null,"",null,null,null,null,null,null,null,""]
[null,null,null,null,null,"H12",null,"Medicines",null,null,null,null,null,null,null,null,null,null,null,null,null,null,null,"",null,null,null,null,null,null,null,"",null,null,null,null,null,null,null,""]
[null,null,null,null,null,"H13",null,"Medical staff (doctor, nurse, etc)",null,null,null,null,null,null,null,null,null,null,null,null,null,null,null,"",null,null,null,null,null,null,null,"",null,null,null,null,null,null,null,""]
[null,null,null,null,null,"H14",null,"School facilities",null,null,null,null,null,null,null,null,null,null,null,null,null,null,null,"",null,null,null,null,null,null,null,"",null,null,null,null,null,null,null,""]
[null,null,null,null,null,"H15",null,"School materials / supplies                                         ",null,null,null,null,null,null,null,null,null,null,null,null,null,null,null,"",null,null,null,null,null,null,null,"",null,null,null,null,null,null,null,""]
[null,null,null,null,null,"H16",null,"Transport to school                     ",null,null,null,null,null,null,null,null,null,null,null,null,null,null,null,"",null,null,null,null,null,null,null,"",null,null,null,null,null,null,null,""]
[null,null,null,null,null,"H17",null,"Well / water tank                          ",null,null,null,null,null,null,null,null,null,null,null,null,null,null,null,"1",null,null,null,null,null,null,null,"",null,null,null,null,null,null,null,{"$error":"#REF!"}]
[null,null,null,null,null,"H18",null,"Bathing spaces                                      ",null,null,null,null,null,null,null,null,null,null,null,null,null,null,null,"",null,null,null,null,null,null,null,"",null,null,null,null,null,null,null,""]
[null,null,null,null,null,"H19",null,"Latrines/toilets                                      ",null,null,null,null,null,null,null,null,null,null,null,null,null,null,null,"3",null,null,null,null,null,null,null,"",null,null,null,null,null,null,null,{"$error":"#REF!"}]
[null,null,null,null,null,"H20",null,"Access to job opportunities        ",null,null,null,null,null,null,null,null,null,null,null,null,null,null,null,"",null,null,null,null,null,null,null,"",null,null,null,null,null,null,null,""]
[null,null,null,null,null,"H21",null,"Cash/money assistance",null,null,null,null,null,null,null,null,null,null,null,null,null,null,null,"",null,null,null,null,null,null,null,"",null,null,null,null,null,null,null,""]
[null,null,null,null,null,"H22",null,"Vocational training                       ",null,null,null,null,null,null,null,null,null,null,null,null,null,null,null,"",null,null,null,null,null,null,null,"3",null,null,null,null,null,null,null,{"$error":"#REF!"}]
[null,null,null,null,null,"H23",null,{"$f":"CONCATENATE(IF(INDEX(H1_01,RS)=\"other\",INDEX(H1_02,RS),\"\"),IF(INDEX(H1_11,RS)=\"other\",INDEX(H1_12,RS),\"\"),IF(INDEX(H1_21,RS)=\"other\",INDEX(H1_22,RS),\"\"))","v":{"$error":"#REF!"}},null,null,null,null,null,null,null,null,null,null,null,null,null,null,null,{"$f":"CONCATENATE(IF(INDEX(H1_01,RS)=\"other\",1,\"\"),IF(INDEX(H1_11,RS)=\"other\",2,\"\"),IF(INDEX(H1_21,RS)=\"other\",3,\"\"))","v":"2"},null,null,null,null,null,null,null,null,null,null,null,null,null,null,null,{"$f":"CONCATENATE(IF(INDEX(H1_01,RS)=\"other\",INDEX(H1_05,RS),\"\"),IF(INDEX(H1_11,RS)=\"other\",INDEX(H1_15,RS),\"\"),IF(INDEX(H1_21,RS)=\"other\",INDEX(H1_25,RS),\"\"))","v":{"$error":"#REF!"}}]
[null,null,null,null,null,"H24",null,{"$f":"CONCATENATE(IF(INDEX(H1_03,RS)=\"other\",INDEX(H1_04,RS),\"\"),IF(INDEX(H1_13,RS)=\"other\",INDEX(H1_14,RS),\"\"),IF(INDEX(H1_23,RS)=\"other\",INDEX(H1_24,RS),\"\"))","v":""},null,null,null,null,null,null,null,null,null,null,null,null,null,null,null,null,null,null,null,null,null,null,null,{"$f":"CONCATENATE(IF(INDEX(H1_03,RS)=\"other\",1,\"\"),IF(INDEX(H1_13,RS)=\"other\",2,\"\"),IF(INDEX(H1_23,RS)=\"other\",3,\"\"))","v":""},null,null,null,null,null,null,null,{"$f":"CONCATENATE(IF(INDEX(H1_03,RS)=\"other\",INDEX(H1_05,RS),\"\"),IF(INDEX(H1_13,RS)=\"other\",INDEX(H1_15,RS),\"\"),IF(INDEX(H1_23,RS)=\"other\",INDEX(H1_25,RS),\"\"))","v":""}]
[]
["This is the end of the interview. Thanks the interviewees for their time and conclude the interview."]

{"sheet":"Camp List","index":8,"n_rows":199,"n_cols":25,"rows_kept":199,"cut":false,"hidden":true,"merged":[]}
["Sr.No","Update Date","Status","State","State_Pcode","District","District_Pcode","TOWNSHIP_NAME","Township_Pcode","VillageTracKTown_Name","VillageTrackTown_Pcode","VillageWard_Name","VillageWard_Pcode","Camp Name","P_Code","Accessibility","Longitude","Latitude","HH","Total","Avg","Source","Method","Type of Accomodation","Comment"]
[20,null,"Closed","Kachin","MMR001","Mohnyin","MMR001D002","Hpakant","MMR001009",null,null,null,null,"1 Ward, Sein Yadanar Company(Lon Khin)","MMR001CMP171","GCA",96.359549999999999,25.658650000000002,2,20,10,""]
[21,null,"Open","Kachin","MMR001","Mohnyin","MMR001D002","Hpakant","MMR001009",null,null,null,null,"5 Ward Baptist Church(lon Khin)","MMR001CMP179","GCA",96.355270000000004,25.656130000000001,164,546,3.3292682926829267,"KBC"]
[22,null,"Open","Kachin","MMR001","Mohnyin","MMR001D002","Hpakant","MMR001009",null,null,null,null,"5 Ward RC Church(lon Khin)","MMR001CMP168","GCA",96.353070000000002,25.655819999999999,164,649,3.9573170731707319,""]
[1,null,"Open","Kachin","MMR001","Bhamo","MMR001D003","Bhamo","MMR001010",null,null,null,null,"AD-2000 Tharthana Compound","MMR001CMP050","GCA",97.238829999999993,24.260719999999999,219,858,3.9178082191780823,"KBSS"]
[23,null,"Open","Kachin","MMR001","Mohnyin","MMR001D002","Hpakant","MMR001009",null,null,null,null,"AG Church, Hmaw Si Sa","MMR001CMP176","GCA",96.345569999999995,25.635300000000001,42,190,4.5238095238095237,""]
[24,null,"Open","Kachin","MMR001","Mohnyin","MMR001D002","Hpakant","MMR001009",null,null,null,null,"AG Church, Maw Wan","MMR001CMP190","GCA",96.317350000000005,25.616509000000001,20,90,4.5,""]
[25,null,"Closed","Kachin","MMR001","Mohnyin","MMR001D002","Hpakant","MMR001009",null,null,null,null,"Anglican Church, Hmaw Si Sar","MMR001CMP173","GCA",null,null,"","",{"$error":"#VALUE!"},""]
[26,null,"Open","Kachin","MMR001","Mohnyin","MMR001D002","Hpakant","MMR001009",null,null,null,null,"Association of Christ, Nam Ma Phyit","MMR001CMP192","GCA",96.339590000000001,25.617998,29,98,3.3793103448275863,""]
[2,null,"Open","Kachin","MMR001","Bhamo","MMR001D003","Bhamo","MMR001010",null,null,null,null,"Aung Thar Church","MMR001CMP194","GCA",97.252650000000003,24.260466999999998,"","",{"$error":"#VALUE!"},"UNHCR"]
[27,null,"Closed","Kachin","MMR001","Mohnyin","MMR001D002","Hpakant","MMR001009",null,null,null,null,"Away Yar Rama Monastery, Ka Day village","MMR001CMP170","GCA",96.339870000000005,25.655989999999999,3,11,3.6666666666666665,""]
[28,null,"Closed","Kachin","MMR001","Mohnyin","MMR001D002","Hpakant","MMR001009",null,null,null,null,"Aye Mya Tharyar Church of Christ ","MMR001CMP092","GCA",null,null,"","",{"$error":"#VALUE!"},""]
[29,null,"Open","Kachin","MMR001","Mohnyin","MMR001D002","Hpakant","MMR001009",null,null,null,null,"Baptist Church, Hmaw Si Sar(Lon Khin)","MMR001CMP169","GCA",96.346469999999997,25.647649999999999,107,441,4.1214953271028039,"KBC"]
[30,null,"Open","Kachin","MMR001","Mohnyin","MMR001D002","Hpakant","MMR001009",null,null,null,null,"Baptist Church, Naung Hmee VT","MMR001CMP188","GCA",96.673805000000002,25.728653000000001,16,68,4.25,""]
[31,null,"Open","Kachin","MMR001","Mohnyin","MMR001D002","Hpakant","MMR001009",null,null,null,null,"Baptist Church, Sai Ra village","MMR001CMP172","GCA",null,null,11,43,3.9090909090909092,"KBC"]
[171,null,"Closed","Kachin","MMR001","Myitkyina","MMR001D001","Waingmaw","MMR001002",null,null,null,null,"Border Post 10","MMR001CMP114",null,97.837778,25.273333000000001,"","",{"$error":"#VALUE!"},""]
[172,null,"Open","Kachin","MMR001","Myitkyina","MMR001D001","Waingmaw","MMR001002",null,null,null,null,"Border Post 8","MMR001CMP113","NGCA",97.915833000000006,25.220278,130,640,4.9230769230769234,"KMSS, Ranir"]
[103,null,"Open","Kachin","MMR001","Bhamo","MMR001D003","Momauk","MMR001012",null,null,null,null,"Bum Tsit Pa ","MMR001CMP129","NGCA",97.609832999999995,24.002433,173,832,4.8092485549132951,"KBSS, Ranir"]
[32,null,"Open","Kachin","MMR001","Mohnyin","MMR001D002","Hpakant","MMR001009",null,null,null,null,"Chin Church, Seik Mu","MMR001CMP109","GCA",96.283377000000002,25.582065,9,35,3.8888888888888888,""]
[33,null,"Closed","Kachin","MMR001","Mohnyin","MMR001D002","Hpakant","MMR001009",null,null,null,null,"Chin(Zomi) Baptist Church","MMR001CMP086","GCA",null,null,23,64,2.7826086956521738,""]
[14,null,"Open","Kachin","MMR001","Myitkyina","MMR001D001","Chipwi","MMR001005",null,null,null,null,"Chipwi KBC camp","MMR001CMP042","GCA",null,null,"",353,{"$error":"#VALUE!"},"Shalom"]
[3,null,"Open","Kachin","MMR001","Bhamo","MMR001D003","Bhamo","MMR001010",null,null,null,null,"Daw Hpum Yang Ninghtawn","MMR001CMP153","GCA",null,null,"","",{"$error":"#VALUE!"},""]
[34,null,"Open","Kachin","MMR001","Mohnyin","MMR001D002","Hpakant","MMR001009",null,null,null,null,"Dhama Rakhita, Nyein Chan Tar Yar Ward(Lon Khin)","MMR001CMP174","GCA",96.354929999999996,25.643090000000001,59,282,4.7796610169491522,""]
[131,null,"Open","Kachin","MMR001","Myitkyina","MMR001D001","Myitkyina","MMR001001",null,null,null,null,"Du Kahtawng Qtr. 14","MMR001CMP012","GCA",97.385101000000006,25.399795999999998,6,36,6,""]
[132,null,"Open","Kachin","MMR001","Myitkyina","MMR001D001","Myitkyina","MMR001001",null,null,null,null,"Du Kahtawng Qtr. 4","MMR001CMP010","GCA",97.383056999999994,25.395994000000002,8,26,3.25,"KBC"]
[133,null,"Open","Kachin","MMR001","Myitkyina","MMR001D001","Myitkyina","MMR001001",null,null,null,null,"Du Kahtawng Qtr. 5","MMR001CMP011","GCA",97.381195000000005,25.396363999999998,6,32,5.333333333333333,""]
[104,null,"Open","Kachin","MMR001","Bhamo","MMR001D003","Momauk","MMR001012",null,null,null,null,"Dum Bung ","MMR001CMP123","NGCA",97.537099999999995,24.461033,125,599,4.7919999999999998,"KMSS, Ranir"]
[35,null,"Closed","Kachin","MMR001","Mohnyin","MMR001D002","Hpakant","MMR001009",null,null,null,null,"Ei Wan Gali Asso., Ward 1, Seik Mu","MMR001CMP180","GCA",null,null,11,30,2.7272727272727271,""]
[36,null,"Closed","Kachin","MMR001","Mohnyin","MMR001D002","Hpakant","MMR001009",null,null,null,null,"Free Christian Asso., Ward 1, Seik Mu","MMR001CMP186","GCA",null,null,26,124,4.7692307692307692,""]
[15,null,"Open","Kachin","MMR001","Myitkyina","MMR001D001","Chipwi","MMR001005",null,null,null,null,"Gant Gwin","MMR001CMP046","GCA",null,null,"","",{"$error":"#VALUE!"},""]
[127,null,"Open","Shan (North)","MMR015","Muse","MMR015D002","Muse","MMR015009",null,null,null,null,"Hka San Camp","MMR015CMP021","NGCA",null,null,"","",{"$error":"#VALUE!"},""]
[173,null,"Open","Kachin","MMR001","Myitkyina","MMR001D001","Waingmaw","MMR001002",null,null,null,null,"Hkat Cho ","MMR001CMP028","GCA",97.408302000000006,25.324567999999999,134,554,4.1343283582089549,"Shalom"]
[174,null,"Open","Kachin","MMR001","Myitkyina","MMR001D001","Waingmaw","MMR001002",null,null,null,null,"Hkau Shau (BP 12)","MMR001CMP115","NGCA",97.807182999999995,25.200333000000001,210,1366,6.5047619047619047,"KBC, Ranir"]
[37,null,"Open","Kachin","MMR001","Mohnyin","MMR001D002","Hpakant","MMR001009",null,null,null,null,"Hlaing Naung Baptist","MMR001CMP148","GCA",96.705960000000005,25.51352,15,47,3.1333333333333333,""]
[38,null,"Open","Kachin","MMR001","Mohnyin","MMR001D002","Hpakant","MMR001009",null,null,null,null,"Hmaw Wan, Anglican","MMR001CMP191","GCA",96.316564,25.615960999999999,28,148,5.2857142857142856,""]
[39,null,"Closed","Kachin","MMR001","Mohnyin","MMR001D002","Hpakant","MMR001009",null,null,null,null,"Hmaw Wan, Baptist Christian Church","MMR001CMP189","GCA",null,null,"","",{"$error":"#VALUE!"},"KBC"]
[4,null,"Open","Kachin","MMR001","Bhamo","MMR001D003","Bhamo","MMR001010",null,null,null,null,"Host Families","MMR001CMP163","GCA",null,null,284,1276,4.492957746478873,""]
[83,null,"Open","Kachin","MMR001","Bhamo","MMR001D003","Mansi","MMR001013",null,null,null,null,"Host Families","MMR001CMP196","GCA",null,null,278,1011,3.6366906474820144,""]
[110,null,"Open","Kachin","MMR001","Bhamo","MMR001D003","Momauk","MMR001012",null,null,null,null,"Host Families","MMR001CMP197","GCA",null,null,421,1369,3.2517814726840855,""]
[166,null,"Open","Kachin","MMR001","Bhamo","MMR001D003","Shwegu","MMR001011",null,null,null,null,"Host Families","MMR001CMP199","GCA",null,null,9,25,2.7777777777777777,""]
[95,null,"Open","Shan (North)","MMR015","Kyaukme","MMR015D003","Manton","MMR015019",null,null,null,null,"Howa","MMR015CMP010","GCA",null,null,"","",{"$error":"#VALUE!"},""]
[129,null,"Open","Shan (North)","MMR015","Muse","MMR015D002","Muse","MMR015009",null,null,null,null,"Hpai Kawng Mare","MMR015CMP022","NGCA",98.115809999999996,24.08738,32,187,5.84375,""]
[16,null,"Open","Kachin","MMR001","Myitkyina","MMR001D001","Chipwi","MMR001005",null,null,null,null,"Hpare Hkyer - BP6","MMR001CMP043","GCA",null,null,"","",{"$error":"#VALUE!"},"Ranir"]
[105,null,"Open","Kachin","MMR001","Bhamo","MMR001D003","Momauk","MMR001012",null,null,null,null,"Hpun Lum Yang ","MMR001CMP122","NGCA",97.573166999999998,24.661466999999998,437,2101,4.8077803203661329,"KBSS, Ranir"]
[5,null,"Open","Kachin","MMR001","Bhamo","MMR001D003","Bhamo","MMR001010",null,null,null,null,"Htoi San Church","MMR001CMP052","GCA",97.236919999999998,24.24766,46,210,4.5652173913043477,"UNHCR"]
[134,null,"Open","Kachin","MMR001","Myitkyina","MMR001D001","Myitkyina","MMR001001",null,null,null,null,"Jan Mai Kawng Baptist Church","MMR001CMP018","GCA",97.389778000000007,25.417733999999999,203,952,4.6896551724137927,"KBC, KMSS"]
[135,null,"Open","Kachin","MMR001","Myitkyina","MMR001D001","Myitkyina","MMR001001",null,null,null,null,"Jan Mai Kawng Catholic Church","MMR001CMP019","GCA",97.373361000000003,25.403476999999999,110,460,4.1818181818181817,""]
[106,null,"Open","Kachin","MMR001","Bhamo","MMR001D003","Momauk","MMR001012",null,null,null,null,"Je Yang Hka ","MMR001CMP121","NGCA",97.568282999999994,24.688167,1632,8446,5.1752450980392153,"KBSS, Ranir"]
[6,null,"Open","Kachin","MMR001","Bhamo","MMR001D003","Bhamo","MMR001010",null,null,null,null,"Kannar Yeik Thar","MMR001CMP048","GCA",97.221556500999995,24.262418020999998,3,13,4.333333333333333,""]
[197,null,"Open","Kachin","MMR001","Bhamo","MMR001D003","Momauk","MMR001012",null,null,null,null,"Khun Sint Village","MMR001CMP200","GCA",null,null,4,26,6.5,""]
[75,null,"Open","Shan (North)","MMR015","Muse","MMR015D002","Kutkai","MMR015011",null,null,null,null,"Kone Khem Camp","MMR015CMP015","GCA",null,null,"","",{"$error":"#VALUE!"},""]
[76,null,"Open","Shan (North)","MMR015","Muse","MMR015D002","Kutkai","MMR015011",null,null,null,null,"Kutkai downtown (KBC Church)","MMR015CMP016","GCA",97.554308000000006,23.271719000000001,"","",{"$error":"#VALUE!"},"KBC"]
[77,null,"Open","Shan (North)","MMR015","Muse","MMR015D002","Kutkai","MMR015011",null,null,null,null,"Kutkai downtown (RC Church)","MMR015CMP017","GCA",97.565616000000006,23.273361000000001,"","",{"$error":"#VALUE!"},""]
[136,null,"Open","Kachin","MMR001","Myitkyina","MMR001D001","Myitkyina","MMR001001",null,null,null,null,"Kyun Pin Thar Baptist Church","MMR001CMP013","GCA",97.405120999999994,25.365891000000001,53,215,4.0566037735849054,"KBC"]
[97,null,"Open","Kachin","MMR001","Mohnyin","MMR001D002","Mogaung","MMR001008",null,null,null,null,"Kyun Taw Baptist Church ","MMR001CMP078","GCA",96.922619999999995,25.305669999999999,15,69,4.5999999999999996,"KBC"]
[74,null,"Open","Kachin","MMR001","Puta-O","MMR001D004","Khaunglanhpu","MMR001018",null,null,null,null,"La Ja","MMR001CMP074","GCA",null,null,22,107,4.8636363636363633,""]
[91,null,"Open","Kachin","MMR001","Bhamo","MMR001D003","Mansi","MMR001013",null,null,null,null,"Lagatyan ","MMR001CMP202","GCA",null,null,85,343,4.0352941176470587,""]
[175,null,"Open","Kachin","MMR001","Myitkyina","MMR001D001","Waingmaw","MMR001002",null,null,null,null,"Laiza Market 3 / Laiza Gat","MMR001CMP117","NGCA",97.551716999999996,24.746817,476,2090,4.3907563025210088,"Ranir"]
[176,null,"Open","Kachin","MMR001","Myitkyina","MMR001D001","Waingmaw","MMR001002",null,null,null,null,"Laiza Muklum Hpyen  Yen Mungshawa ni","MMR001CMP149","NGCA",null,null,834,4387,5.2601918465227815,""]
[17,null,"Open","Kachin","MMR001","Myitkyina","MMR001D001","Chipwi","MMR001005",null,null,null,null,"Lan Jaw ","MMR001CMP045","GCA",98.354146999999998,25.708763000000001,"","",{"$error":"#VALUE!"},""]
[107,null,"Open","Kachin","MMR001","Bhamo","MMR001D003","Momauk","MMR001012",null,null,null,null,"Lana Zup Ja ","MMR001CMP128","NGCA",97.625617000000005,24.056132999999999,608,2703,4.4457236842105265,"KBSS, Ranir"]
[165,null,"Open","Kachin","MMR001","Bhamo","MMR001D003","Shwegu","MMR001011",null,null,null,null,"Lawk Awng Mare D. (Sinbo Area)","MMR001CMP147","NGCA",null,null,375,1691,4.5093333333333332,""]
[73,null,"Open","Kachin","MMR001","Myitkyina","MMR001D001","Injangyang","MMR001003",null,null,null,null,"Lawk Hkawng Ginwang","MMR001CMP146","GCA",null,null,"","",{"$error":"#VALUE!"},""]
[137,null,"Open","Kachin","MMR001","Myitkyina","MMR001D001","Myitkyina","MMR001001",null,null,null,null,"Le Kone Bethlehem Church","MMR001CMP015","GCA",97.409317000000001,25.362189999999998,84,440,5.2380952380952381,"KBC"]
[138,null,"Open","Kachin","MMR001","Myitkyina","MMR001D001","Myitkyina","MMR001001",null,null,null,null,"Le Kone Ziun Baptist Church ","MMR001CMP014","GCA",97.408919999999995,25.355983999999999,151,743,4.9205298013245029,"KBC"]
[18,null,"Open","Kachin","MMR001","Myitkyina","MMR001D001","Chipwi","MMR001005",null,null,null,null,"Lhaovao Baptist Church (LBC)","MMR001CMP195","GCA",null,null,95.4,477,5,""]
[40,null,"Open","Kachin","MMR001","Mohnyin","MMR001D002","Hpakant","MMR001009",null,null,null,null,"Lisu Baptist Church, Maw Shan Vil,. Seik Mu","MMR001CMP181","GCA",null,null,37,116,3.1351351351351351,""]
[41,null,"Open","Kachin","MMR001","Mohnyin","MMR001D002","Hpakant","MMR001009",null,null,null,null,"Lisu Baptist Church, Maw Wan Ward","MMR001CMP167","GCA",96.316400000000002,25.61842,11,40,3.6363636363636362,""]
[7,null,"Open","Kachin","MMR001","Bhamo","MMR001D003","Bhamo","MMR001010",null,null,null,null,"Lisu Boarding-House","MMR001CMP049","GCA",97.241630000000001,24.266110000000001,63,315,5,"UNHCR"]
[111,null,"Open","Kachin","MMR001","Bhamo","MMR001D003","Momauk","MMR001012",null,null,null,null,"Loi Je Baptist Church","MMR001CMP071","GCA",97.718582999999995,24.200972,19,106,5.5789473684210522,"UNHCR"]
[112,null,"Open","Kachin","MMR001","Bhamo","MMR001D003","Momauk","MMR001012",null,null,null,null,"Loi Je Catholic Church","MMR001CMP069","GCA",97.724566999999993,24.205417000000001,59,281,4.7627118644067794,"KBSS"]
[113,null,"Open","Kachin","MMR001","Bhamo","MMR001D003","Momauk","MMR001012",null,null,null,null,"Loi Je Lisu Camp","MMR001CMP070","GCA",97.717133000000004,24.200433,127,631,4.9685039370078741,"UNHCR"]
[84,null,"Open","Kachin","MMR001","Bhamo","MMR001D003","Mansi","MMR001013",null,null,null,null,"Lung Kawk  ( Hka Hkye Zup)","MMR001CMP135","NGCA",97.585667000000001,23.9055,89,346,3.8876404494382024,"Ranir"]
[42,null,"Closed","Kachin","MMR001","Mohnyin","MMR001D002","Hpakant","MMR001009",null,null,null,null,"Ma Mon Buddhist Monastery","MMR001CMP107","GCA",null,null,"","",{"$error":"#VALUE!"},""]
[177,null,"Open","Kachin","MMR001","Myitkyina","MMR001D001","Waingmaw","MMR001002",null,null,null,null,"Mading Baptist Church","MMR001CMP027","GCA",97.451965000000001,25.356632000000001,23,114,4.9565217391304346,"KBC, Shalom"]
[178,null,"Open","Kachin","MMR001","Myitkyina","MMR001D001","Waingmaw","MMR001002",null,null,null,null,"Maga Yang ","MMR001CMP119","NGCA",97.715230000000005,24.980250000000002,622,2790,4.485530546623794,"KMSS, Ranir"]
[114,null,"Open","Kachin","MMR001","Bhamo","MMR001D003","Momauk","MMR001012",null,null,null,null,"Mai Khat ","MMR001CMP064","GCA",null,null,2,9,4.5,""]
[179,null,"Open","Kachin","MMR001","Myitkyina","MMR001D001","Waingmaw","MMR001002",null,null,null,null,"Maina AG Church","MMR001CMP031","GCA",97.435233999999994,25.425276,107,493,4.6074766355140184,"Shalom"]
[180,null,"Open","Kachin","MMR001","Myitkyina","MMR001D001","Waingmaw","MMR001002",null,null,null,null,"Maina Catholic Church (St. Joseph)","MMR001CMP029","GCA",97.438450000000003,25.415900000000001,243,1078,4.4362139917695469,"KMSS"]
[181,null,"Open","Kachin","MMR001","Myitkyina","MMR001D001","Waingmaw","MMR001002",null,null,null,null,"Maina KBC (Bawng Ring)","MMR001CMP040","GCA",97.437434999999994,25.411413,384,1694,4.411458333333333,"KBC"]
[182,null,"Open","Kachin","MMR001","Myitkyina","MMR001D001","Waingmaw","MMR001002",null,null,null,null,"Maina Lawang Baptist Church","MMR001CMP039","GCA",97.426297000000005,25.409566000000002,47,184,3.9148936170212765,"KBC"]
[139,null,"Open","Kachin","MMR001","Myitkyina","MMR001D001","Myitkyina","MMR001001",null,null,null,null,"Maliyang Baptist Church","MMR001CMP016","GCA",97.411606000000006,25.360475999999998,77,329,4.2727272727272725,"KBC"]
[115,null,"Open","Kachin","MMR001","Bhamo","MMR001D003","Momauk","MMR001012",null,null,null,null,"Man Bung Catholic compound","MMR001CMP062","GCA",97.325019999999995,24.245100000000001,18,65,3.6111111111111112,"KBSS"]
[140,null,"Open","Kachin","MMR001","Myitkyina","MMR001D001","Myitkyina","MMR001001",null,null,null,null,"Man Hkring Baptist Church","MMR001CMP008","GCA",97.418694000000002,25.428910999999999,88,370,4.2045454545454541,"KBC"]
[116,null,"Open","Kachin","MMR001","Bhamo","MMR001D003","Momauk","MMR001012",null,null,null,null,"Man Nawng ","MMR001CMP063","GCA",97.321659999999994,24.41,28,136,4.8571428571428568,""]
[117,null,"Open","Kachin","MMR001","Bhamo","MMR001D003","Momauk","MMR001012",null,null,null,null,"Man Ting","MMR001CMP198","GCA",null,null,"","",{"$error":"#VALUE!"},""]
[85,null,"Open","Kachin","MMR001","Bhamo","MMR001D003","Mansi","MMR001013",null,null,null,null,"Man Wing Baptist Church","MMR001CMP133","NGCA",null,null,114,549,4.8157894736842106,"KBC"]
[86,null,"Open","Kachin","MMR001","Bhamo","MMR001D003","Mansi","MMR001013",null,null,null,null,"Man Wing Catholic Church","MMR001CMP132","NGCA",97.334630000000004,23.51491,308,1515,4.9188311688311686,"KBSS"]
[87,null,"Open","Kachin","MMR001","Bhamo","MMR001D003","Mansi","MMR001013",null,null,null,null,"Man Wing Host Families","MMR001CMP134","NGCA",null,null,262,1300,4.9618320610687023,""]
[183,null,"Open","Kachin","MMR001","Myitkyina","MMR001D001","Waingmaw","MMR001002",null,null,null,null,"Manau Compound","MMR001CMP118","GCA",97.550267000000005,24.747966999999999,"","",{"$error":"#VALUE!"},""]
[118,null,"Open","Kachin","MMR001","Bhamo","MMR001D003","Momauk","MMR001012",null,null,null,null,"Mandalay Monestry","MMR001CMP058","GCA",97.346940000000004,24.251860000000001,8,25,3.125,"UNHCR"]
[94,null,"Open","Shan (North)","MMR015","Kyaukme","MMR015D003","Manton","MMR015019",null,null,null,null,"Mandung - Jinghpaw","MMR015CMP009","NGCA",null,null,53,260,4.9056603773584904,"KBC"]
[98,null,"Open","Kachin","MMR001","Mohnyin","MMR001D002","Mogaung","MMR001008",null,null,null,null,"Mang Hawng Baptist Church","MMR001CMP077","GCA",96.942279999999997,25.296579999999999,16,69,4.3125,"KBC"]
[88,null,"Open","Kachin","MMR001","Bhamo","MMR001D003","Mansi","MMR001013",null,null,null,null,"Mansi Baptist Church","MMR001CMP066","GCA",97.291820000000001,24.129059999999999,84,348,4.1428571428571432,"UNHCR"]
[43,null,"Closed","Kachin","MMR001","Mohnyin","MMR001D002","Hpakant","MMR001009",null,null,null,null,"Mashi Kahtawng Baptist  Church","MMR001CMP094","GCA",96.310928000000004,25.609179999999999,25,110,4.4000000000000004,"KBC"]
[44,null,"Closed","Kachin","MMR001","Mohnyin","MMR001D002","Hpakant","MMR001009",null,null,null,null,"Mashi Kahtawng Catholic Church","MMR001CMP093","GCA",null,null,"","",{"$error":"#VALUE!"},""]
[45,null,"Closed","Kachin","MMR001","Mohnyin","MMR001D002","Hpakant","MMR001009",null,null,null,null,"Mashi Kahtawng Evangelical Church","MMR001CMP096","GCA",null,null,"","",{"$error":"#VALUE!"},""]
[46,null,"Closed","Kachin","MMR001","Mohnyin","MMR001D002","Hpakant","MMR001009",null,null,null,null,"Mashi Kahtawng Municipal Dammar Yone","MMR001CMP098","GCA",null,null,"","",{"$error":"#VALUE!"},""]
[47,null,"Closed","Kachin","MMR001","Mohnyin","MMR001D002","Hpakant","MMR001009",null,null,null,null,"Mashi Kahtawng Myo Oo Taw Ya Monestry","MMR001CMP099","GCA",null,null,"","",{"$error":"#VALUE!"},""]
[48,null,"Closed","Kachin","MMR001","Mohnyin","MMR001D002","Hpakant","MMR001009",null,null,null,null,"Mashi Kahtawng Rakhine traditional group","MMR001CMP095","GCA",null,null,"","",{"$error":"#VALUE!"},""]
[49,null,"Closed","Kachin","MMR001","Mohnyin","MMR001D002","Hpakant","MMR001009",null,null,null,null,"Mashi Kahtawng Shan Traditional Monestry","MMR001CMP100","GCA",null,null,"","",{"$error":"#VALUE!"},""]
[50,null,"Closed","Kachin","MMR001","Mohnyin","MMR001D002","Hpakant","MMR001009",null,null,null,null,"Mashi Kahtawng Yaung Chi Oo Thi la shin Monestry","MMR001CMP097","GCA",null,null,"","",{"$error":"#VALUE!"},""]
[141,null,"Open","Kachin","MMR001","Myitkyina","MMR001D001","Myitkyina","MMR001001",null,null,null,null,"Maw Hpawng Hka Nan Baptist Church","MMR001CMP020","GCA",97.284729999999996,25.374020000000002,26,102,3.9230769230769229,"Shalom"]
[142,null,"Open","Kachin","MMR001","Myitkyina","MMR001D001","Myitkyina","MMR001001",null,null,null,null,"Maw Hpawng Lhaovo Baptist Church","MMR001CMP021","GCA",97.291079999999994,25.371179999999999,20,99,4.95,"Shalom"]
[51,null,"Closed","Kachin","MMR001","Mohnyin","MMR001D002","Hpakant","MMR001009",null,null,null,null,"Maw Si Zar, Thiriyardanar Sein, Damma Compound, Lone Khin","MMR001CMP106","GCA",96.343350000000001,25.6447,"","",{"$error":"#VALUE!"},""]
[52,null,"Closed","Kachin","MMR001","Mohnyin","MMR001D002","Hpakant","MMR001009",null,null,null,null,"Maw Wan, Catholic Church","MMR001CMP090","GCA",null,null,"","",{"$error":"#VALUE!"},""]
[53,null,"Closed","Kachin","MMR001","Mohnyin","MMR001D002","Hpakant","MMR001009",null,null,null,null,"Maw Wan, Kachin Baptist Church","MMR001CMP085","GCA",96.316210999999996,25.619221,70,324,4.628571428571429,""]
[54,null,"Closed","Kachin","MMR001","Mohnyin","MMR001D002","Hpakant","MMR001009",null,null,null,null,"Maw Wan, Kyauk Hlaing Gu Pagoda Compound","MMR001CMP084","GCA",null,null,"","",{"$error":"#VALUE!"},""]
[55,null,"Open","Kachin","MMR001","Mohnyin","MMR001D002","Hpakant","MMR001009",null,null,null,null,"Maw Wan, Mu-yin Baptist Church","MMR001CMP091","GCA",96.319687999999999,25.615202,28,82,2.9285714285714284,""]
[56,null,"Closed","Kachin","MMR001","Mohnyin","MMR001D002","Hpakant","MMR001009",null,null,null,null,"Maw Wan, Myo Oo Pagoda","MMR001CMP088","GCA",null,null,"","",{"$error":"#VALUE!"},""]
[57,null,"Closed","Kachin","MMR001","Mohnyin","MMR001D002","Hpakant","MMR001009",null,null,null,null,"May Di Ka Rama Monastery(Lon Khin)","MMR001CMP178","GCA",96.359309999999994,25.651440000000001,"","",{"$error":"#VALUE!"},""]
[78,null,"Open","Shan (North)","MMR015","Muse","MMR015D002","Kutkai","MMR015011",null,null,null,null,"Mine Yu Lay village","MMR015CMP018","GCA",97.474305999999999,23.352518,"","",{"$error":"#VALUE!"},""]
[169,null,"Closed","Kachin","MMR001","Myitkyina","MMR001D001","Waingmaw","MMR001002",null,null,null,null,"Moke Lwe Village / Hkar Shi","MMR001CMP035",null,97.421104,25.328987000000001,"","",{"$error":"#VALUE!"},""]
[119,null,"Open","Kachin","MMR001","Bhamo","MMR001D003","Momauk","MMR001012",null,null,null,null,"Momauk Baptist Church","MMR001CMP056","GCA",97.344359999999995,24.250689999999999,384,1502,3.9114583333333335,"UNHCR"]
[120,null,"Open","Kachin","MMR001","Bhamo","MMR001D003","Momauk","MMR001012",null,null,null,null,"Momauk Catholic Church (St. Patrick)","MMR001CMP057","GCA",97.346950000000007,24.25177,285,1036,3.6350877192982458,"KBSS"]
[128,null,"Open","Shan (North)","MMR015","Muse","MMR015D002","Muse","MMR015009",null,null,null,null,"Munekoe Pa (Giwang) - Hka San (Mung  Go  Pa ) ","MMR015CMP012","NGCA",null,null,53,192,3.6226415094339623,"KBC"]
[130,null,"Open","Shan (North)","MMR015","Muse","MMR015D002","Muse","MMR015009",null,null,null,null,"Mung Baw ","MMR015CMP005","NGCA",null,null,123,503,4.0894308943089435,"KBC"]
[156,null,"Open","Shan (North)","MMR015","Muse","MMR015D002","Namhkan","MMR015010",null,null,null,null,"Mung Ding Pa ","MMR015CMP023","NGCA",null,null,"",149,{"$error":"#VALUE!"},""]
[92,null,"Open","Kachin","MMR001","Bhamo","MMR001D003","Mansi","MMR001013",null,null,null,null,"Mung Ding Pa  (Boarder)","MMR001CMP203","NGCA",null,null,29.8,149,5,""]
[79,null,"Open","Shan (North)","MMR015","Muse","MMR015D002","Kutkai","MMR015011",null,null,null,null,"Mungji Pa Dabang (Baptist Church)         ","MMR015CMP006","NGCA",98.220614999999995,23.400155999999999,67,296,4.4179104477611943,"KBC"]
[80,null,"Open","Shan (North)","MMR015","Muse","MMR015D002","Kutkai","MMR015011",null,null,null,null,"Mungji Pa Dabang (RC Church)         ","MMR015CMP019","GCA",98.213958000000005,23.391741,"","",{"$error":"#VALUE!"},""]
[58,null,"Open","Kachin","MMR001","Mohnyin","MMR001D002","Hpakant","MMR001009",null,null,null,null,"Muring Baptist Church, Awng Ra, Wa Ra Zut VT","MMR001CMP177","GCA",96.354159999999993,25.658670000000001,26,55,2.1153846153846154,""]
[8,null,"Open","Kachin","MMR001","Bhamo","MMR001D003","Bhamo","MMR001010",null,null,null,null,"Mu-yin Baptist Church","MMR001CMP051","GCA",97.234200000000001,24.253067000000001,4,12,3,"UNHCR"]
[143,null,"Open","Kachin","MMR001","Myitkyina","MMR001D001","Myitkyina","MMR001001",null,null,null,null,"Myay Myint Baptist Church","MMR001CMP017","GCA",97.376671999999999,25.387862999999999,12,53,4.416666666666667,"Shalom"]
[121,null,"Open","Kachin","MMR001","Bhamo","MMR001D003","Momauk","MMR001012",null,null,null,null,"Myo Thit ","MMR001CMP061","GCA",null,null,13,53,4.0769230769230766,""]
[89,null,"Open","Kachin","MMR001","Bhamo","MMR001D003","Mansi","MMR001013",null,null,null,null,"Nam Hka Mare (west of Man Wing)","MMR001CMP136","NGCA",null,null,73,637,8.7260273972602747,""]
[158,null,"Open","Shan (North)","MMR015","Muse","MMR015D002","Namhkan","MMR015010",null,null,null,null,"Nam Hkam - Nay Win Ni (Palawng)","MMR015CMP004","NGCA",null,null,93,375,4.032258064516129,"KBC"]
[159,null,"Open","Shan (North)","MMR015","Muse","MMR015D002","Namhkan","MMR015010",null,null,null,null,"Nam Hkam (KBC Jaw Wang)","MMR015CMP001","NGCA",null,null,98,444,4.5306122448979593,"KBC"]
[160,null,"Open","Shan (North)","MMR015","Muse","MMR015D002","Namhkan","MMR015010",null,null,null,null,"Nam Hkam Catholic Church ( St. Thomas I)","MMR015CMP003","NGCA",null,null,47,192,4.0851063829787231,"KBSS"]
[161,null,"Open","Shan (North)","MMR015","Muse","MMR015D002","Namhkan","MMR015010",null,null,null,null,"Nam Hkam Catholic Church ( St. Thomas II)","MMR015CMP024","NGCA",null,null,"","",{"$error":"#VALUE!"},""]
[157,null,"Open","Shan (North)","MMR015","Muse","MMR015D002","Namhkan","MMR015010",null,null,null,null,"Nam Hkam Malut Jak ","MMR015CMP002","NGCA",null,null,46,207,4.5,""]
[162,null,"Open","Shan (North)","MMR015","Muse","MMR015D002","Namhkan","MMR015010",null,null,null,null,"Nam Hkawng","MMR001CMP139","NGCA",null,null,"","",{"$error":"#VALUE!"},"KBC"]
[96,null,"Open","Shan (North)","MMR015","Kyaukme","MMR015D003","Manton","MMR015019",null,null,null,null,"Nam Hkyet","MMR015CMP011","GCA",null,null,"","",{"$error":"#VALUE!"},"KBSS"]
[81,null,"Open","Shan (North)","MMR015","Muse","MMR015D002","Kutkai","MMR015011",null,null,null,null,"Nam Hpak Ka Mare ","MMR015CMP007","NGCA",97.490750000000006,23.413948999999999,81,275,3.3950617283950617,"KBC"]
[93,null,"Open","Kachin","MMR001","Bhamo","MMR001D003","Mansi","MMR001013",null,null,null,null,"Nam Lim Pa    (Boarder)","MMR001CMP204","NGCA",null,null,35.4,177,5,""]
[90,null,"Open","Kachin","MMR001","Bhamo","MMR001D003","Mansi","MMR001013",null,null,null,null,"Nam Lim Pa - Scattered IDPs in forest","MMR001CMP137","NGCA",null,null,193,911,4.7202072538860103,"KBSS"]
[163,null,"Open","Shan (North)","MMR015","Kyaukme","MMR015D003","Namtu","MMR015015",null,null,null,null,"Nam Tu","MMR015CMP014","NGCA",null,null,18,74,4.1111111111111107,"KBC"]
[144,null,"Open","Kachin","MMR001","Myitkyina","MMR001D001","Myitkyina","MMR001001",null,null,null,null,"Nan Kway St. John Catholic Church","MMR001CMP024","GCA",97.359380000000002,25.411770000000001,73,318,4.3561643835616435,""]
[9,null,"Open","Kachin","MMR001","Bhamo","MMR001D003","Bhamo","MMR001010",null,null,null,null,"Nant Hlaing Church","MMR001CMP054","GCA",97.315860000000001,24.32638,21,101,4.8095238095238093,"KBSS"]
[59,null,"Open","Kachin","MMR001","Mohnyin","MMR001D002","Hpakant","MMR001009",null,null,null,null,"Nant Ma Hpit Catholic Church","MMR001CMP103","GCA",96.341352999999998,25.613894999999999,96,332,3.4583333333333335,""]
[100,null,"Open","Kachin","MMR001","Mohnyin","MMR001D002","Mohnyin","MMR001007",null,null,null,null,"Nant Mun","MMR001CMP081","GCA",96.364949999999993,24.998349999999999,22,101,4.5909090909090908,""]
[99,null,"Open","Kachin","MMR001","Mohnyin","MMR001D002","Mogaung","MMR001008",null,null,null,null,"Nat Gyi Kone Baptist Church ","MMR001CMP079","GCA",96.948740000000001,25.30442,14,50,3.5714285714285716,"KBC"]
[184,null,"Open","Kachin","MMR001","Myitkyina","MMR001D001","Waingmaw","MMR001002",null,null,null,null,"Nawng Hee Village","MMR001CMP033","GCA",97.345039,25.351965,18,72,4,""]
[101,null,"Open","Kachin","MMR001","Mohnyin","MMR001D002","Mohnyin","MMR001007",null,null,null,null,"Nawng Ing (Indawgyi) Baptist Church  ","MMR001CMP152","GCA",null,null,"","",{"$error":"#VALUE!"},"KBC"]
[170,null,"Closed","Kachin","MMR001","Myitkyina","MMR001D001","Waingmaw","MMR001002",null,null,null,null,"Nawng Si Paw Village / Inn Lay","MMR001CMP034",null,null,null,"","",{"$error":"#VALUE!"},""]
[60,null,"Open","Kachin","MMR001","Mohnyin","MMR001D002","Hpakant","MMR001009",null,null,null,null,"Nga Pyaw Taw Baptist Nursery School ","MMR001CMP082","GCA",96.312790000000007,25.611160000000002,143,543,3.7972027972027971,"KBC"]
[61,null,"Closed","Kachin","MMR001","Mohnyin","MMR001D002","Hpakant","MMR001009",null,null,null,null,"Nga Pyaw Taw Roman Catholic Church","MMR001CMP083","GCA",96.31326,25.611899999999999,"","",{"$error":"#VALUE!"},""]
[108,null,"Open","Kachin","MMR001","Bhamo","MMR001D003","Momauk","MMR001012",null,null,null,null,"Nhkawng Pa ","MMR001CMP131","NGCA",97.669366999999994,24.378167000000001,380,1701,4.4763157894736842,"KBSS, Ranir"]
[122,null,"Open","Kachin","MMR001","Bhamo","MMR001D003","Momauk","MMR001012",null,null,null,null,"Ni Thaw Ka Monestry","MMR001CMP059","GCA",97.347740000000002,24.253769999999999,26,101,3.8846153846153846,"UNHCR"]
[145,null,"Open","Kachin","MMR001","Myitkyina","MMR001D001","Myitkyina","MMR001001",null,null,null,null,"Njang Dung Baptist Church ","MMR001CMP002","GCA",97.394547000000003,25.422194000000001,58,238,4.1034482758620694,"KBC"]
[123,null,"Open","Kachin","MMR001","Bhamo","MMR001D003","Momauk","MMR001012",null,null,null,null,"Nyaung Na Pin ","MMR001CMP072","GCA",97.724483000000006,24.205417000000001,47,258,5.4893617021276597,"UNHCR"]
[146,null,"Open","Kachin","MMR001","Myitkyina","MMR001D001","Myitkyina","MMR001001",null,null,null,null,"Pa Dauk Myaing(Pa La Na)","MMR001CMP162","GCA",97.4345,25.493819999999999,31,163,5.258064516129032,""]
[109,null,"Open","Kachin","MMR001","Bhamo","MMR001D003","Momauk","MMR001012",null,null,null,null,"Pa Kahtawng ","MMR001CMP126","NGCA",97.752667000000002,24.2744,486,2699,5.5534979423868309,"KBSS, Ranir"]
[185,null,"Open","Kachin","MMR001","Myitkyina","MMR001D001","Waingmaw","MMR001002",null,null,null,null,"Pajau / Jan Mai","MMR001CMP120","NGCA",97.751389000000003,24.831944,172,708,4.1162790697674421,"KBC, Ranir"]
[62,null,"Closed","Kachin","MMR001","Mohnyin","MMR001D002","Hpakant","MMR001009",null,null,null,null,"Parami, Charity Office, MyoMa Quarter","MMR001CMP102","GCA",null,null,"","",{"$error":"#VALUE!"},""]
[10,null,"Open","Kachin","MMR001","Bhamo","MMR001D003","Bhamo","MMR001010",null,null,null,null,"Phan Khar Kone","MMR001CMP193","GCA",97.252650000000003,24.222349999999999,17,70,4.117647058823529,"UNHCR"]
[124,null,"Open","Kachin","MMR001","Bhamo","MMR001D003","Momauk","MMR001012",null,null,null,null,"Phar Kay/Nant Waing ","MMR001CMP065","GCA",97.429860000000005,24.630859999999998,31,147,4.741935483870968,""]
[186,null,"Open","Kachin","MMR001","Myitkyina","MMR001D001","Waingmaw","MMR001002",null,null,null,null,"Post 6 Camp","MMR001CMP160","NGCA",97.990555999999998,25.265277999999999,109,540,4.9541284403669721,"KMSS, Ranir"]
[187,null,"Open","Kachin","MMR001","Myitkyina","MMR001D001","Waingmaw","MMR001002",null,null,null,null,"Qtr. 2 Lhaovo Baptist Church","MMR001CMP032","GCA",97.441483000000005,25.354883999999998,118,332,2.8135593220338984,"Shalom"]
[188,null,"Open","Kachin","MMR001","Myitkyina","MMR001D001","Waingmaw","MMR001002",null,null,null,null,"Qtr. 2 Myoma Baptist Church","MMR001CMP025","GCA",97.438271,25.351655000000001,81,364,4.4938271604938276,"KBC"]
[189,null,"Open","Kachin","MMR001","Myitkyina","MMR001D001","Waingmaw","MMR001002",null,null,null,null,"Qtr. 3 Mu-yin  Baptist Church","MMR001CMP030","GCA",97.437568999999996,25.346004000000001,28,131,4.6785714285714288,"Shalom"]
[190,null,"Open","Kachin","MMR001","Myitkyina","MMR001D001","Waingmaw","MMR001002",null,null,null,null,"Qtr. 4 Monestry (Thargaya Thayett Taw)","MMR001CMP026","GCA",97.432495000000003,25.350809000000002,101,524,5.1881188118811883,"Shalom"]
[63,null,"Open","Kachin","MMR001","Mohnyin","MMR001D002","Hpakant","MMR001009",null,null,null,null,"Rawan Baptist Church, Maw Shan Vil., Seik Mu","MMR001CMP182","GCA",96.279200000000003,25.56551,7,30,4.2857142857142856,""]
[11,null,"Open","Kachin","MMR001","Bhamo","MMR001D003","Bhamo","MMR001010",null,null,null,null,"Robert Church","MMR001CMP047","GCA",97.228769999999997,24.26502,514,2487,4.8385214007782098,"UNHCR"]
[64,null,"Closed","Kachin","MMR001","Mohnyin","MMR001D002","Hpakant","MMR001009",null,null,null,null,"Sa Baw Sarsana Parla Monastery","MMR001CMP108","GCA",null,null,"","",{"$error":"#VALUE!"},""]
[65,null,"Open","Kachin","MMR001","Mohnyin","MMR001D002","Hpakant","MMR001009",null,null,null,null,"Sai Nai Baptish Church, Maw Shan Vil., Seki Mu","MMR001CMP183","GCA",96.353030000000004,25.668399999999998,60,198,3.3,"KBC"]
[66,null,"Closed","Kachin","MMR001","Mohnyin","MMR001D002","Hpakant","MMR001009",null,null,null,null,"San Kyel, Masoe Yein Monestry","MMR001CMP104","GCA",null,null,"","",{"$error":"#VALUE!"},""]
[125,null,"Open","Kachin","MMR001","Bhamo","MMR001D003","Momauk","MMR001012",null,null,null,null,"Seng Ja ","MMR001CMP073","GCA",24.207332999999998,97.710864000000001,32,173,5.40625,"KBC, UNHCR"]
[147,null,"Open","Kachin","MMR001","Myitkyina","MMR001D001","Myitkyina","MMR001001",null,null,null,null,"Shatapru Sut Ngai Tawng","MMR001CMP006","GCA",97.399628000000007,25.412313000000001,96,396,4.125,""]
[148,null,"Open","Kachin","MMR001","Myitkyina","MMR001D001","Myitkyina","MMR001001",null,null,null,null,"Shatapru Thida Aye Baptist Church","MMR001CMP007","GCA",97.418004999999994,25.423817,16,73,4.5625,"KBC, Shalom"]
[191,null,"Open","Kachin","MMR001","Myitkyina","MMR001D001","Waingmaw","MMR001002",null,null,null,null,"Shing Jai","MMR001CMP041","GCA",98.025662999999994,25.418084,182,948,5.2087912087912089,""]
[167,null,"Open","Kachin","MMR001","Bhamo","MMR001D003","Shwegu","MMR001011",null,null,null,null,"Shwe Gu Baptist Church","MMR001CMP067","GCA",96.807353000000006,24.200361000000001,106,263,2.4811320754716979,"UNHCR"]
[168,null,"Open","Kachin","MMR001","Bhamo","MMR001D003","Shwegu","MMR001011",null,null,null,null,"Shwe Gu Catholic Church","MMR001CMP068","GCA",null,null,45,174,3.8666666666666667,"KBSS"]
[149,null,"Open","Kachin","MMR001","Myitkyina","MMR001D001","Myitkyina","MMR001001",null,null,null,null,"Shwe Zet Baptist Church","MMR001CMP009","GCA",97.419403000000003,25.440928,74,364,4.9189189189189193,"KBC"]
[102,null,"Open","Kachin","MMR001","Mohnyin","MMR001D002","Mohnyin","MMR001007",null,null,null,null,"St. Patrick Catholic Church ","MMR001CMP080","GCA",96.367059999999995,24.764800000000001,12,42,3.5,""]
[12,null,"Open","Kachin","MMR001","Bhamo","MMR001D003","Bhamo","MMR001010",null,null,null,null,"Ta Gun Taing Monastery (Shwe Kyi Na)","MMR001CMP055","GCA",97.227789999999999,24.29138,74,318,4.2972972972972974,"UNHCR"]
[67,null,"Closed","Kachin","MMR001","Mohnyin","MMR001D002","Hpakant","MMR001009",null,null,null,null,"Tar Ma Hkan Buddhist Monastery, Haung Par","MMR001CMP110","GCA",null,null,"","",{"$error":"#VALUE!"},""]
[126,null,"Open","Kachin","MMR001","Bhamo","MMR001D003","Momauk","MMR001012",null,null,null,null,"Tarli ","MMR001CMP060","GCA",null,null,10,38,3.8,""]
[150,null,"Open","Kachin","MMR001","Myitkyina","MMR001D001","Myitkyina","MMR001001",null,null,null,null,"Tat Kone Baptist Church","MMR001CMP001","GCA",97.386718999999999,25.415482000000001,62,260,4.193548387096774,"KBC"]
[151,null,"Open","Kachin","MMR001","Myitkyina","MMR001D001","Myitkyina","MMR001001",null,null,null,null,"Tat Kone COC Baptist / Tat Kone Htoi San","MMR001CMP023","GCA",97.388400000000004,25.40982,69,322,4.666666666666667,"Shalom"]
[152,null,"Open","Kachin","MMR001","Myitkyina","MMR001D001","Myitkyina","MMR001001",null,null,null,null,"Tat Kone Emanuel Church","MMR001CMP004","GCA",97.379272,25.401074999999999,14,61,4.3571428571428568,"Shalom"]
[153,null,"Open","Kachin","MMR001","Myitkyina","MMR001D001","Myitkyina","MMR001001",null,null,null,null,"Tat Kone Galile Baptist Church","MMR001CMP003","GCA",97.377662999999998,25.404752999999999,30,139,4.6333333333333337,"KBC"]
[154,null,"Open","Kachin","MMR001","Myitkyina","MMR001D001","Myitkyina","MMR001001",null,null,null,null,"Tat Kone San Pya Baptist Church","MMR001CMP005","GCA",97.382192000000003,25.404015000000001,43,185,4.3023255813953485,"KBC"]
[192,null,"Open","Kachin","MMR001","Myitkyina","MMR001D001","Waingmaw","MMR001002",null,null,null,null,"Thargaya Lisu Baptist Church","MMR001CMP037","GCA",97.427959999999999,25.33351,74,323,4.3648648648648649,"Shalom"]
[68,null,"Closed","Kachin","MMR001","Mohnyin","MMR001D002","Hpakant","MMR001009",null,null,null,null,"Thiri Mingalar Manizay Yone, Myoma Quarter","MMR001CMP101","GCA",null,null,"","",{"$error":"#VALUE!"},""]
[164,null,"Open","Kachin","MMR001","Puta-O","MMR001D004","Puta-O","MMR001014",null,null,null,null,"Tote Tan Ward","MMR001CMP075","GCA",null,null,"","",{"$error":"#VALUE!"},""]
[193,null,"Open","Kachin","MMR001","Myitkyina","MMR001D001","Waingmaw","MMR001002",null,null,null,null,"Waingmaw AG Church","MMR001CMP038","GCA",97.443702000000002,25.351241999999999,77,372,4.8311688311688314,"Shalom"]
[194,null,"Open","Kachin","MMR001","Myitkyina","MMR001D001","Waingmaw","MMR001002",null,null,null,null,"Waingmaw Baptist Zonal Office","MMR001CMP036","GCA",97.438259000000002,25.355841999999999,132,132,1,"KBC"]
[69,null,"Open","Kachin","MMR001","Mohnyin","MMR001D002","Hpakant","MMR001009",null,null,null,null,"Ward 2 Cahotlic Church, Seik Mu","MMR001CMP185","GCA",96.288250000000005,25.57921,75,288,3.84,""]
[70,null,"Open","Kachin","MMR001","Mohnyin","MMR001D002","Hpakant","MMR001009",null,null,null,null,"Ward 2 Sai Taung Baptist Church, Seik Mu ","MMR001CMP184","GCA",96.286680000000004,25.577559999999998,134,503,3.7537313432835822,""]
[195,null,"Open","Kachin","MMR001","Myitkyina","MMR001D001","Waingmaw","MMR001002",null,null,null,null,"Woi Chyai ","MMR001CMP116","NGCA",97.567116999999996,24.768383,840,4296,5.1142857142857139,"Ranir"]
[19,null,"Open","Kachin","MMR001","Myitkyina","MMR001D001","Chipwi","MMR001005",null,null,null,null,"Women's Affairs Association Building","MMR001CMP044","GCA",null,null,"","",{"$error":"#VALUE!"},""]
[71,null,"Closed","Kachin","MMR001","Mohnyin","MMR001D002","Hpakant","MMR001009",null,null,null,null,"Wrad(5) Christian Association","MMR001CMP175","GCA",null,null,15,93,6.2,""]
[155,null,"Open","Kachin","MMR001","Myitkyina","MMR001D001","Myitkyina","MMR001001",null,null,null,null,"Wun Tho Buddhist Monastery","MMR001CMP022","GCA",97.403407999999999,25.377545999999999,24,104,4.333333333333333,"Shalom"]
[13,null,"Open","Kachin","MMR001","Bhamo","MMR001D003","Bhamo","MMR001010",null,null,null,null,"Yoe Kyi Monastery","MMR001CMP053","GCA",97.240639999999999,24.24953,31,108,3.4838709677419355,"UNHCR"]
[72,null,"Open","Kachin","MMR001","Mohnyin","MMR001D002","Hpakant","MMR001009",null,null,null,null,"Yumar Baptist Church","MMR001CMP105","GCA",96.306910999999999,25.599250000000001,49,245,5,"KBC"]
[196,null,"Open","Kachin","MMR001","Myitkyina","MMR001D001","Waingmaw","MMR001002",null,null,null,null,"Zai Awng / Mung Ga Zup","MMR001CMP111","NGCA",97.756789999999995,25.106670000000001,627,2643,4.2153110047846889,"KBC, Ranir"]
[198,null,"Closed","Kachin","MMR001","Mohnyin","MMR001D002","Hpakant","MMR001009",null,null,null,null,"Zomee Baptist Church camp, Hmaw Wan","MMR001CMP201","GCA",96.315601999999998,25.615006000000001,6,27,4.5,""]
[82,null,"Open","Shan (North)","MMR015","Muse","MMR015D002","Kutkai","MMR015011",null,null,null,null,"Zup Aung Camp","MMR015CMP020","GCA",null,null,"","",{"$error":"#VALUE!"},""]

{"sheet":"Mimu_Township","index":9,"n_rows":85,"n_cols":6,"rows_kept":85,"cut":false,"hidden":true,"merged":[]}
["ST","ST_PCODE","DT","DT_PCODE","TS_PCODE","TS"]
["Kachin","MMR001","Bhamo","MMR001D003","Bhamo","MMR001010"]
["Kachin","MMR001","Myitkyina","MMR001D001","Chipwi","MMR001005"]
["Kachin","MMR001","Mohnyin","MMR001D002","Hpakant","MMR001009"]
["Kachin","MMR001","Myitkyina","MMR001D001","Injangyang","MMR001003"]
["Kachin","MMR001","Puta-O","MMR001D004","Khaunglanhpu","MMR001018"]
["Kachin","MMR001","Puta-O","MMR001D004","Machanbaw","MMR001016"]
["Kachin","MMR001","Bhamo","MMR001D003","Mansi","MMR001013"]
["Kachin","MMR001","Mohnyin","MMR001D002","Mogaung","MMR001008"]
["Kachin","MMR001","Mohnyin","MMR001D002","Mohnyin","MMR001007"]
["Kachin","MMR001","Bhamo","MMR001D003","Momauk","MMR001012"]
["Kachin","MMR001","Myitkyina","MMR001D001","Myitkyina","MMR001001"]
["Kachin","MMR001","Puta-O","MMR001D004","Nawngmun","MMR001017"]
["Kachin","MMR001","Puta-O","MMR001D004","Puta-O","MMR001014"]
["Kachin","MMR001","Bhamo","MMR001D003","Shwegu","MMR001011"]
["Kachin","MMR001","Puta-O","MMR001D004","Sumprabum","MMR001015"]
["Kachin","MMR001","Myitkyina","MMR001D001","Tanai","MMR001004"]
["Kachin","MMR001","Myitkyina","MMR001D001","Tsawlaw","MMR001006"]
["Kachin","MMR001","Myitkyina","MMR001D001","Waingmaw","MMR001002"]
["Shan (North)","MMR015","Mong Maw_ Shan Special Region II (Wa)","MMR015D331","Aik Chan (Ai' Chun)","MMR015311"]
["Shan (North)","MMR015","Laukkaing_Shan Special Region I (Kokang)","MMR015D221","Chinshwehaw Sub-township_SR I","MMR015203"]
["Shan (North)","MMR015","Mong Maw_ Shan Special Region II (Wa)","MMR015D331","Hkun Mar (Hkwin Ma)","MMR015306"]
["Shan (North)","MMR015","Hopang","MMR015D006","Hopang","MMR015021"]
["Shan (South)","MMR014","Taunggyi","MMR014D001","Hopong","MMR014003"]
["Shan (North)","MMR015","Mong Maw_ Shan Special Region II (Wa)","MMR015D331","Hsawng Hpa (Saun Pha)","MMR015305"]
["Shan (North)","MMR015","Lashio","MMR015D001","Hseni","MMR015002"]
["Shan (South)","MMR014","Taunggyi","MMR014D001","Hsihseng","MMR014004"]
["Shan (North)","MMR015","Kyaukme","MMR015D003","Hsipaw","MMR015014"]
["Shan (North)","MMR015","Mong Maw_ Shan Special Region II (Wa)","MMR015D331","Ka Lawng Hpar","MMR015310"]
["Shan (South)","MMR014","Taunggyi","MMR014D001","Kalaw","MMR014005"]
["Shan (North)","MMR015","Mong Maw_ Shan Special Region II (Wa)","MMR015D331","Kawng Min Hsang","MMR015304"]
["Shan (North)","MMR015","Laukkaing","MMR015D005","Konkyan","MMR015023"]
["Shan (North)","MMR015","Laukkaing_Shan Special Region I (Kokang)","MMR015D221","Konkyan_SR I","MMR015201"]
["Shan (South)","MMR014","Loilen","MMR014D002","Kunhing","MMR014014"]
["Shan (North)","MMR015","Kunlong","MMR015D004","Kunlong","MMR015020"]
["Shan (North)","MMR015","Muse","MMR015D002","Kutkai","MMR015011"]
["Shan (North)","MMR015","Kyaukme","MMR015D003","Kyaukme","MMR015012"]
["Shan (South)","MMR014","Loilen","MMR014D002","Kyethi","MMR014015"]
["Shan (South)","MMR014","Loilen","MMR014D002","Laihka","MMR014012"]
["Shan (South)","MMR014","Langkho","MMR014D003","Langkho","MMR014018"]
["Shan (North)","MMR015","Lashio","MMR015D001","Lashio","MMR015001"]
["Shan (North)","MMR015","Laukkaing","MMR015D005","Laukkaing","MMR015022"]
["Shan (North)","MMR015","Laukkaing_Shan Special Region I (Kokang)","MMR015D221","Laukkaing_SR I","MMR015202"]
["Shan (South)","MMR014","Taunggyi","MMR014D001","Lawksawk","MMR014008"]
["Shan (North)","MMR015","Mong Maw_ Shan Special Region II (Wa)","MMR015D331","Lin Haw","MMR015309"]
["Shan (South)","MMR014","Loilen","MMR014D002","Loilen","MMR014011"]
["Shan (North)","MMR015","Mong Maw_ Shan Special Region II (Wa)","MMR015D331","Long Htan","MMR015307"]
["Shan (North)","MMR015","Kyaukme","MMR015D003","Mabein","MMR015018"]
["Shan (North)","MMR015","Wein Kawng (Wein Kao)_ Shan Special Region II (Wa)","MMR015D332","Man Man Hseng","MMR015313"]
["Shan (North)","MMR015","Mong Maw_ Shan Special Region II (Wa)","MMR015D331","Man Tun","MMR015303"]
["Shan (North)","MMR015","Kyaukme","MMR015D003","Manton","MMR015019"]
["Shan (North)","MMR015","Hopang","MMR015D006","Matman","MMR015024"]
["Shan (South)","MMR014","Langkho","MMR014D003","Mawkmai","MMR014020"]
["Shan (South)","MMR014","Loilen","MMR014D002","Monghsu","MMR014017"]
["Shan (South)","MMR014","Loilen","MMR014D002","Mongkaing","MMR014016"]
["Shan (North)","MMR015","Hopang","MMR015D006","Mongmao","MMR015008"]
["Shan (North)","MMR015","Kyaukme","MMR015D003","Mongmit","MMR015017"]
["Shan (South)","MMR014","Langkho","MMR014D003","Mongnai","MMR014019"]
["Shan (South)","MMR014","Langkho","MMR014D003","Mongpan","MMR014021"]
["Shan (North)","MMR015","Lashio","MMR015D001","Mongyai","MMR015003"]
["Shan (North)","MMR015","Muse","MMR015D002","Muse","MMR015009"]
["Shan (North)","MMR015","Wein Kawng (Wein Kao)_ Shan Special Region II (Wa)","MMR015D332","Nam Hkam Wu","MMR015315"]
["Shan (North)","MMR015","Mong Maw_ Shan Special Region II (Wa)","MMR015D331","Nam Tit","MMR015301"]
["Shan (North)","MMR015","Muse","MMR015D002","Namhkan","MMR015010"]
["Shan (North)","MMR015","Kyaukme","MMR015D003","Namhsan","MMR015016"]
["Shan (North)","MMR015","Kyaukme","MMR015D003","Namtu","MMR015015"]
["Shan (South)","MMR014","Loilen","MMR014D002","Nansang","MMR014013"]
["Shan (North)","MMR015","Wein Kawng (Wein Kao)_ Shan Special Region II (Wa)","MMR015D332","Nar Kawng","MMR015316"]
["Shan (North)","MMR015","Mong Maw_ Shan Special Region II (Wa)","MMR015D331","Nar Wee (Na Wi)","MMR015302"]
["Shan (North)","MMR015","Hopang","MMR015D006","Narhpan","MMR015006"]
["Shan (North)","MMR015","Wein Kawng (Wein Kao)_ Shan Special Region II (Wa)","MMR015D332","Nawng Hkit","MMR015314"]
["Shan (North)","MMR015","Kyaukme","MMR015D003","Nawnghkio","MMR015013"]
["Shan (South)","MMR014","Taunggyi","MMR014D001","Nyaungshwe","MMR014002"]
["Shan (North)","MMR015","Wein Kawng (Wein Kao)_ Shan Special Region II (Wa)","MMR015D332","Pang Hkam","MMR015317"]
["Shan (North)","MMR015","Wein Kawng (Wein Kao)_ Shan Special Region II (Wa)","MMR015D332","Pang Yang","MMR015318"]
["Shan (North)","MMR015","Hopang","MMR015D006","Pangsang","MMR015005"]
["Shan (North)","MMR015","Hopang","MMR015D006","Pangwaun","MMR015007"]
["Shan (South)","MMR014","Taunggyi","MMR014D001","Pekon","MMR014010"]
["Shan (South)","MMR014","Taunggyi","MMR014D001","Pindaya","MMR014006"]
["Shan (South)","MMR014","Taunggyi","MMR014D001","Pinlaung","MMR014009"]
["Shan (North)","MMR015","Lashio","MMR015D001","Tangyan","MMR015004"]
["Shan (South)","MMR014","Taunggyi","MMR014D001","Taunggyi","MMR014001"]
["Shan (North)","MMR015","Mong Maw_ Shan Special Region II (Wa)","MMR015D331","Yawng Lin","MMR015308"]
["Shan (North)","MMR015","Mong Maw_ Shan Special Region II (Wa)","MMR015D331","Yin Pang","MMR015312"]
["Shan (South)","MMR014","Taunggyi","MMR014D001","Ywangan","MMR014007"]

{"sheet":"Stat_01","index":10,"n_rows":35,"n_cols":4,"rows_kept":35,"cut":false,"hidden":true,"merged":[]}
[]
[]
["Row Labels","Sum of D13_01","Sum of D13_02","Sum of D13_03"]
["Bhamo",1937,2183,4120]
["Chipwi",210,242,452]
["Dinga",1068,1076,2144]
["East Thar Si",180,123,303]
["Han Te",63,45,108]
["Hpakan",163,168,331]
["Hpare No.(7) Quarter",416,404,820]
["Kar Hlaing ",422,411,833]
["Kutkai",78,94,172]
["Loi Je",576,594,1170]
["Lone Khin",546,608,1154]
["Man wing Gyi",263,286,549]
["Mansi",1451,1852,3303]
["Maung Gu",39,60,99]
["Minar AG",268,259,527]
["Mine Yu Lay",169,209,378]
["Mogaung ",17,23,40]
["Momauk",5776,6036,11812]
["Mone si",130,121,251]
["Myitkyina",475,590,1065]
["Nam San Yang",88,123,211]
["Nan Mon",47,50,97]
["Nba Pa",327,416,743]
["Prang Kadung",681,845,1526]
["Saga Pa",546,643,1189]
["San Pai",1210,1408,2618]
["Seng Taung",177,194,371]
["Shwe Kyi Na ",151,156,307]
["Shwegu",111,143,254]
["Uang Lung",1294,1581,2875]
["(blank)",1164,1333,394]
["Grand Total",20043,22276,40216]

{"sheet":"NFI_3Ws","index":11,"n_rows":127,"n_cols":9,"rows_kept":127,"cut":false,"hidden":true,"merged":[[0,0,2,0],[0,1,2,1],[0,2,2,2],[1,3,2,3]]}
["Township","Locations' ID (or) Camps' Code","Standardized Name of IDPs Camps"]
[null,null,null,"Organisation Name"]
[null,null,null,null,null,null,null,"CP"]
["Myitkyina","MMR001CMP001","Tat Kone Baptist Church","KBC, UNHCR",null,null,null,"MMR001CMP001",{"$f":"MATCH(B4,H4,1)","v":1}]
["Myitkyina","MMR001CMP002","Njang Dung Baptist Church ","KBC, UNHCR",null,null,null,"MMR001CMP002",{"$f":"MATCH(B5,H5,1)","v":1}]
["Myitkyina","MMR001CMP003","Tat Kone Galile Baptist Church","KBC, UNHCR",null,null,null,"MMR001CMP003",1]
["Myitkyina","MMR001CMP004","Tat Kone Emanuel Church","KMSS, UNHCR, DRC",null,null,null,"MMR001CMP004",1]
["Myitkyina","MMR001CMP005","Tat Kone San Pya Baptist Church","KBC, UNHCR",null,null,null,"MMR001CMP005",1]
["Myitkyina","MMR001CMP006","Shatapru Sut Ngai Tawng","UNHCR",null,null,null,"MMR001CMP006",1]
["Myitkyina","MMR001CMP007","Shatapru Thida Aye Baptist Church","KBC, UNHCR, DRC",null,null,null,"MMR001CMP007",1]
["Myitkyina","MMR001CMP008","Man Hkring Baptist Church","KBC, UNHCR",null,null,null,"MMR001CMP008",1]
["Myitkyina","MMR001CMP009","Shwe Zet Baptist Church","KMSS, UNHCR",null,null,null,"MMR001CMP009",1]
["Myitkyina","MMR001CMP010","Du Kahtawng Qtr. 4","KBC, UNHCR",null,null,null,"MMR001CMP010",1]
["Myitkyina","MMR001CMP011","Du Kahtawng Qtr. 5","KBC, UNHCR",null,null,null,"MMR001CMP011",1]
["Myitkyina","MMR001CMP012","Du Kahtawng Qtr. 14","KBC, UNHCR",null,null,null,"MMR001CMP012",1]
["Myitkyina","MMR001CMP013","Kyun Pin Thar Baptist Church","KBC, UNHCR",null,null,null,"MMR001CMP013",1]
["Myitkyina","MMR001CMP014","Le Kone Ziun Baptist Church ","KBC, UNHCR",null,null,null,"MMR001CMP014",1]
["Myitkyina","MMR001CMP016","Maliyang Baptist Church","KBC, UNHCR",null,null,null,"MMR001CMP016",1]
["Myitkyina","MMR001CMP017","Myay Myint Baptist Church","KBC, UNHCR, DRC",null,null,null,"MMR001CMP017",1]
["Myitkyina","MMR001CMP019","Jan Mai Kawng Catholic Church","KMSS, UNHCR",null,null,null,"MMR001CMP019",1]
["Myitkyina","MMR001CMP020","Maw Hpawng Hka Nan Baptist Church","KBC, UNHCR, DRC",null,null,null,"MMR001CMP020",1]
["Myitkyina","MMR001CMP021","Maw Hpawng Lhaovo Baptist Church","KBC, UNHCR, DRC",null,null,null,"MMR001CMP021",1]
["Myitkyina","MMR001CMP022","Wun Tho Buddhist Monastery","UNHCR, DRC",null,null,null,"MMR001CMP022",1]
["Myitkyina","MMR001CMP023","Tat Kone COC Baptist / Tat Kone Htoi San","KBC, UNHCR, DRC",null,null,null,"MMR001CMP023",1]
["Myitkyina","MMR001CMP024","Nan Kway St. John Catholic Church","UNHCR",null,null,null,"MMR001CMP024",1]
["Waingmaw","MMR001CMP025","Qtr. 2 Myoma Baptist Church","UNHCR, World Vision",null,null,null,"MMR001CMP025",1]
["Waingmaw","MMR001CMP026","Qtr. 4 Monestry (Thargaya Thayett Taw)","UNHCR, World Vision, DRC",null,null,null,"MMR001CMP026",1]
["Waingmaw","MMR001CMP027","Mading Baptist Church","World Vision, DRC",null,null,null,"MMR001CMP027",1]
["Waingmaw","MMR001CMP028","Hkat Cho ","UNHCR, World Vision, DRC",null,null,null,"MMR001CMP028",1]
["Waingmaw","MMR001CMP029","Maina Catholic Church (St. Joseph)","KMSS, UNHCR, World Vision",null,null,null,"MMR001CMP029",1]
["Waingmaw","MMR001CMP030","Qtr. 3 Mu-yin  Baptist Church","UNHCR, World Vision, DRC",null,null,null,"MMR001CMP030",1]
["Waingmaw","MMR001CMP031","Maina AG Church","UNHCR, World Vision, DRC",null,null,null,"MMR001CMP031",1]
["Waingmaw","MMR001CMP032","Qtr. 2 Lhaovo Baptist Church","UNHCR, World Vision, DRC",null,null,null,"MMR001CMP032",1]
["Waingmaw","MMR001CMP036","Waingmaw Baptist Zonal Office","KBC, UNHCR, World Vision",null,null,null,"MMR001CMP036",1]
["Waingmaw","MMR001CMP037","Thargaya Lisu Baptist Church","UNHCR, DRC",null,null,null,"MMR001CMP037",1]
["Waingmaw","MMR001CMP038","Waingmaw AG Church","UNHCR",null,null,null,"MMR001CMP038",1]
["Waingmaw","MMR001CMP039","Maina Lawang Baptist Church","KBC, UNHCR",null,null,null,"MMR001CMP039",1]
["Waingmaw","MMR001CMP040","Maina KBC (Bawng Ring)","KBC, UNHCR",null,null,null,"MMR001CMP040",1]
["Chipwi","MMR001CMP042","Chipwi KBC camp","UNHCR",null,null,null,"MMR001CMP042",1]
["Chipwi","MMR001CMP043","Hpare Hkyer - BP6","UNHCR,KBC, DRC",null,null,null,"MMR001CMP043",1]
["Bhamo","MMR001CMP047","Robert Church","KBC, UNHCR",null,null,null,"MMR001CMP047",1]
["Bhamo","MMR001CMP049","Lisu Boarding-House","UNHCR",null,null,null,"MMR001CMP049",1]
["Bhamo","MMR001CMP050","AD-2000 Tharthana Compound","KBSS, UNHCR",null,null,null,"MMR001CMP050",1]
[null,"MMR001CMP051",null,null,null,null,null,"MMR001CMP051",1]
[null,"MMR001CMP052",null,null,null,null,null,"MMR001CMP052",1]
["Bhamo","MMR001CMP053","Yoe Kyi Monastery","UNHCR",null,null,null,"MMR001CMP053",1]
["Bhamo","MMR001CMP054","Nant Hlaing Church","UNHCR",null,null,null,"MMR001CMP054",1]
["Bhamo","MMR001CMP055","Ta Gun Taing Monastery (Shwe Kyi Na)","UNHCR",null,null,null,"MMR001CMP055",1]
["Momauk","MMR001CMP056","Momauk Baptist Church","UNHCR",null,null,null,"MMR001CMP056",1]
["Momauk","MMR001CMP057","Momauk Catholic Church (St. Patrick)","UNHCR",null,null,null,"MMR001CMP057",1]
["Momauk","MMR001CMP062","Man Bung Catholic compound","UNHCR",null,null,null,"MMR001CMP058",1]
["Momauk","MMR001CMP064","Mai Khat ","UNHCR",null,null,null,"MMR001CMP059",1]
["Mansi","MMR001CMP066","Mansi Baptist Church","UNHCR",null,null,null,"MMR001CMP062",1]
["Shwegu","MMR001CMP067","Shwe Gu Baptist Church","KBSS, UNHCR",null,null,null,"MMR001CMP066",1]
["Shwegu","MMR001CMP068","Shwe Gu Catholic Church","KBSS, UNHCR",null,null,null,"MMR001CMP067",1]
["Momauk","MMR001CMP069","Loi Je Catholic Church","UNHCR",null,null,null,"MMR001CMP068",1]
["Momauk","MMR001CMP070","Loi Je Lisu Camp","UNHCR",null,null,null,"MMR001CMP069",1]
["Momauk","MMR001CMP071","Loi Je Baptist Church","UNHCR",null,null,null,"MMR001CMP070",1]
["Momauk","MMR001CMP072","Nyaung Na Pin ","UNHCR",null,null,null,"MMR001CMP072",1]
["Momauk","MMR001CMP073","Seng Ja ","UNHCR",null,null,null,"MMR001CMP073",1]
["Mogaung","MMR001CMP077","Mang Hawng Baptist Church","UNHCR",null,null,null,"MMR001CMP077",1]
["Mogaung","MMR001CMP078","Kyun Taw Baptist Church ","UNHCR",null,null,null,"MMR001CMP078",1]
["Mogaung","MMR001CMP079","Nat Gyi Kone Baptist Church ","UNHCR",null,null,null,"MMR001CMP079",1]
[null,"MMR001CMP081",null,null,null,null,null,"MMR001CMP081",1]
["Hpakan","MMR001CMP082","Nga Pyaw Taw Baptist Nursery School ","KBC, UNHCR",null,null,null,"MMR001CMP082",1]
["Hpakan","MMR001CMP091","Maw Wan, Mu-yin Baptist Church","UNHCR",null,null,null,"MMR001CMP091",1]
["Hpakan","MMR001CMP103","Nant Ma Hpit Catholic Church","UNHCR",null,null,null,"MMR001CMP103",1]
["Hpakan","MMR001CMP105","Yumar Baptist Church","UNHCR",null,null,null,"MMR001CMP105",1]
["Hpakan","MMR001CMP109","Chin Church, Seik Mu","UNHCR",null,null,null,"MMR001CMP109",1]
["Waingmaw","MMR001CMP111","Zai Awng / Mung Ga Zup","IRRC, UNHCR, KBC, DRC",null,null,null,"MMR001CMP111",{"$f":"MATCH(B70,H70,1)","v":1}]
["Waingmaw","MMR001CMP113","Border Post 8","UNHCR, KMSS, DRC",null,null,null,"MMR001CMP113",1]
["Waingmaw","MMR001CMP115","Hkau Shau (BP 12)","KBC, DRC",null,null,null,"MMR001CMP115",1]
["Waingmaw","MMR001CMP116","Woi Chyai ","DRC, Shalom",null,null,null,"MMR001CMP116",1]
[null,"MMR001CMP117",null,null,null,null,null,"MMR001CMP117",1]
["Waingmaw","MMR001CMP119","Maga Yang ","IRRC, KMSS, UNHCR",null,null,null,"MMR001CMP119",1]
["Waingmaw","MMR001CMP120","Pajau / Jan Mai","KBC, DRC",null,null,null,"MMR001CMP120",1]
["Momauk","MMR001CMP121","Je Yang Hka ","IRRC, UNHCR",null,null,null,"MMR001CMP121",1]
["Momauk","MMR001CMP122","Hpun Lum Yang ","IRRC, UNHCR",null,null,null,"MMR001CMP122",1]
["Momauk","MMR001CMP123","Dum Bung ","UNHCR",null,null,null,"MMR001CMP123",1]
["Momauk","MMR001CMP126","Pa Kahtawng ","UNHCR",null,null,null,"MMR001CMP126",1]
["Momauk","MMR001CMP128","Lana Zup Ja ","UNHCR",null,null,null,"MMR001CMP128",1]
["Momauk","MMR001CMP129","Bum Tsit Pa ","UNHCR",null,null,null,"MMR001CMP129",1]
["Momauk","MMR001CMP131","Nhkawng Pa ","UNHCR",null,null,null,"MMR001CMP131",1]
[null,"MMR001CMP132",null,null,null,null,null,"MMR001CMP132",1]
["Mansi","MMR001CMP133","Man Wing Baptist Church","UNHCR",null,null,null,"MMR001CMP133",1]
["Mansi","MMR001CMP135","Lung Kawk  ( Hka Hkye Zup)","UNHCR",null,null,null,"MMR001CMP135",1]
["Namhkan","MMR001CMP139","Nam Hkawng","KBC, UNHCR",null,null,null,"MMR001CMP139",1]
["Hpakan","MMR001CMP148","Hlaing Naung Baptist","KBC, UNHCR",null,null,null,"MMR001CMP148",1]
["Waingmaw","MMR001CMP160","Post 6 Camp","UNHCR, KMSS, DRC",null,null,null,"MMR001CMP160",1]
["Myitkyina","MMR001CMP162","Pa Dauk Myaing(Pa La Na)","UNHCR",null,null,null,"MMR001CMP162",1]
["Hpakan","MMR001CMP167","Lisu Baptist Church, Maw Wan Ward","KBC, UNHCR",null,null,null,"MMR001CMP167",1]
["Hpakan","MMR001CMP168","5 Ward RC Church(lon Khin)","KBC, UNHCR",null,null,null,"MMR001CMP168",1]
["Hpakan","MMR001CMP169","Baptist Church, Hmaw Si Sar(Lon Khin)","UNHCR",null,null,null,"MMR001CMP169",1]
[null,"MMR001CMP172",null,null,null,null,null,"MMR001CMP172",1]
["Hpakan","MMR001CMP174","Dhama Rakhita, Nyein Chan Tar Yar Ward(Lon Khin)","UNHCR",null,null,null,"MMR001CMP174",1]
["Hpakan","MMR001CMP175","Wrad(5) Christian Association","UNHCR",null,null,null,"MMR001CMP176",{"$error":"#N/A"}]
["Hpakan","MMR001CMP177","Muring Baptist Church, Awng Ra, Wa Ra Zut VT","UNHCR",null,null,null,"MMR001CMP177",1]
[null,"MMR001CMP179",null,null,null,null,null,"MMR001CMP179",1]
["Hpakan","MMR001CMP181","Lisu Baptist Church, Maw Shan Vil,. Seik Mu","KBC, UNHCR",null,null,null,"MMR001CMP181",1]
["Hpakan","MMR001CMP182","Rawan Baptist Church, Maw Shan Vil., Seik Mu","UNHCR",null,null,null,"MMR001CMP182",1]
[null,"MMR001CMP183",null,null,null,null,null,"MMR001CMP183",1]
["Hpakan","MMR001CMP184","Ward 2 Sai Taung Baptist Church, Seik Mu ","UNHCR",null,null,null,"MMR001CMP184",1]
[null,"MMR001CMP185",null,null,null,null,null,"MMR001CMP185",1]
["Hpakan","MMR001CMP190","AG Church, Maw Wan","UNHCR",null,null,null,"MMR001CMP190",1]
[null,"MMR001CMP191",null,null,null,null,null,"MMR001CMP191",1]
["Hpakan","MMR001CMP192","Association of Christ, Nam Ma Phyit","UNHCR",null,null,null,"MMR001CMP192",1]
[null,"MMR001CMP194",null,null,null,null,null,"MMR001CMP194",{"$f":"MATCH(B108,H107,1)","v":1}]
["Chipwi","MMR001CMP195","Lhaovao Baptist Church (LBC)","UNHCR",null,null,null,"MMR001CMP195",1]
[null,"MMR001CMP202",null,null,null,null,null,"MMR001CMP202",1]
[null,"MMR001CMP203",null,null,null,null,null,"MMR001CMP203",1]
[null,"MMR001CMP204",null,null,null,null,null,"MMR001CMP204",1]
[null,"MMR001CMP207",null,null,null,null,null,"MMR001CMP207",1]
["Namhkan","MMR015CMP001","Nam Hkam (KBC Jaw Wang)","KBC, UNHCR",null,null,null,"MMR015CMP001",{"$f":"MATCH(B115,H113,1)","v":1}]
[null,null,null,null,null,null,null,"MMR015CMP003",1]
["Namhkan","MMR015CMP004","Nam Hkam - Nay Win Ni (Palawng)","KBC, UNHCR",null,null,null,"MMR015CMP004",1]
["Kutkai","MMR015CMP006","Mungji Pa Dabang (Baptist Church)         ","KBC, UNHCR",null,null,null,"MMR015CMP006",1]
["Kutkai","MMR015CMP007","Nam Hpak Ka Mare ","KBC, UNHCR",null,null,null,"MMR015CMP007",1]
["Manton","MMR015CMP009","Mandung - Jinghpaw","KBC, UNHCR",null,null,null,"MMR015CMP009",1]
["Muse","MMR015CMP012","Munekoe Pa (Giwang) - Hka San (Mung  Go  Pa ) ","KBC, UNHCR",null,null,null,"MMR015CMP012",{"$f":"MATCH(B122,H119,1)","v":1}]
["Namtu","MMR015CMP014","Nam Tu","UNHCR",null,null,null,"MMR015CMP014",{"$f":"MATCH(B127,H120,1)","v":1}]
[null,"MMR015CMP015",null,null,null,null,null,"MMR015CMP015",{"$error":"#N/A"}]
["Kutkai","MMR015CMP016","Kutkai downtown (KBC Church)","KBC, UNHCR",null,null,null,"MMR015CMP016",{"$error":"#N/A"}]
[null,"MMR015CMP017",null,null,null,null,null,"MMR015CMP017",{"$error":"#N/A"}]
[null,"MMR015CMP018",null,null,null,null,null,"MMR015CMP018",{"$error":"#N/A"}]
[null,"MMR015CMP019",null,null,null,null,null,"MMR015CMP019",{"$error":"#N/A"}]
[null,"MMR015CMP020",null,null,null,null,null,"MMR015CMP020",{"$error":"#N/A"}]
["Namhkan","MMR015CMP023","Mung Ding Pa ","KBC, UNHCR"]

{"sheet":"HEALTH","index":12,"n_rows":70,"n_cols":27,"rows_kept":70,"cut":false,"hidden":false,"merged":[[25,16,43,16],[44,16,68,16],[69,16,69,17],[23,18,23,20],[23,21,23,26],[23,17,24,17],[23,16,24,16]]}
[]
[]
[]
[]
[]
[null,null,null,null,null,null,null,null,null,null,null,null,null,null,null,null,"HEALTH ISSUES REPORTED"]
[null,null,null,null,null,null,null,null,null,null,null,null,null,null,null,null,"State","Total Number of Sites","Total Number of Individuals","High fever (i.e. Malaria)","Skin problems","Measles","Acute Watery Diarrhoea","Respiratory Infection","Unimmunised Children against measles","Unimmunised Children against polio"]
[null,null,null,null,null,null,null,null,null,null,null,null,null,null,null,null,"Kachin",{"$f":"COUNTIF(Data!Q:Q,Q8)","v":110},{"$f":"SUMIF(Data!Q:Q,Q8,Data!DH:DH)","v":64047},{"$f":"IFERROR(SUMIF([1]Data!$M:$M,$Q8,[1]Data!CJ:CJ)/$R8/100*$S8,0)","v":0},{"$f":"IFERROR(SUMIF([1]Data!$M:$M,$Q8,[1]Data!CK:CK)/$R8/100*$S8,0)","v":0},{"$f":"IFERROR(SUMIF([1]Data!$M:$M,$Q8,[1]Data!CL:CL)/$R8/100*$S8,0)","v":0},{"$f":"IFERROR(SUMIF([1]Data!$M:$M,$Q8,[1]Data!CM:CM)/$R8/100*$S8,0)","v":0},{"$f":"IFERROR(SUMIF([1]Data!$M:$M,$Q8,[1]Data!CN:CN)/$R8/100*$S8,0)","v":0},{"$f":"IFERROR(SUMIF([1]Data!$M:$M,$Q8,[1]Data!CS:CS)/$R8/100*$S8,0)","v":0},{"$f":"IFERROR(SUMIF([1]Data!$M:$M,$Q8,[1]Data!CT:CT)/$R8/100*$S8,0)","v":0}]
[null,null,null,null,null,null,null,null,null,null,null,null,null,null,null,null,"Shan (North)",{"$f":"COUNTIF(Data!Q:Q,Q9)","v":16},{"$f":"SUMIF(Data!Q:Q,Q9,Data!DH:DH)","v":4005},{"$f":"IFERROR(SUMIF([1]Data!$M:$M,$Q9,[1]Data!CJ:CJ)/$R9/100*$S9,0)","v":0},{"$f":"IFERROR(SUMIF([1]Data!$M:$M,$Q9,[1]Data!CK:CK)/$R9/100*$S9,0)","v":0},{"$f":"IFERROR(SUMIF([1]Data!$M:$M,$Q9,[1]Data!CL:CL)/$R9/100*$S9,0)","v":0},{"$f":"IFERROR(SUMIF([1]Data!$M:$M,$Q9,[1]Data!CM:CM)/$R9/100*$S9,0)","v":0},{"$f":"IFERROR(SUMIF([1]Data!$M:$M,$Q9,[1]Data!CN:CN)/$R9/100*$S9,0)","v":0},{"$f":"IFERROR(SUMIF([1]Data!$M:$M,$Q9,[1]Data!CS:CS)/$R9/100*$S9,0)","v":0},{"$f":"IFERROR(SUMIF([1]Data!$M:$M,$Q9,[1]Data!CT:CT)/$R9/100*$S9,0)","v":0}]
[null,null,null,null,null,null,null,null,null,null,null,null,null,null,null,null,"TOTALS",{"$f":"SUM(R8:R9)","v":126},68052,0,0,0,0,0,0,0]
[null,null,null,null,null,null,null,null,null,null,null,null,null,null,null,null,"Percentages %",null,null,{"$f":"T10/$S$10","v":0},0,0,0,0,0,0]
[null,null,null,null,null,null,null,null,null,null,null,null,null,null,null,null,null,null,null,{"$f":"100%-T11","v":1},{"$f":"100%-U11","v":1},1,1,1,1,1]
[]
[null,null,null,null,null,null,null,null,null,null,null,null,null,null,null,null,"NEAREST HEALTH FACILITY"]
[null,null,null,null,null,null,null,null,null,null,null,null,null,null,null,null,"State","less than 0.25 miles","Between 0.25 & 0.5 miles","Between 0.5 & 0.75 miles","Between 0.75 & 1 mile","Between 1 & 5 miles","Greater than  5 miles"]
[null,null,null,null,null,null,null,null,null,null,null,null,null,null,null,null,"All camps",{"$f":"COUNTIF(Data!$ED:$ED, \"< 0.25\")","v":6},{"$f":"COUNTIFS(Data!$ED:$ED, \"<=0.5\")-R16","v":14},{"$f":"COUNTIFS(Data!$ED:$ED, \"<=0.75\")-S16","v":7},{"$f":"COUNTIFS(Data!$ED:$ED, \"<=1\")-T16","v":21},{"$f":"COUNTIFS(Data!$ED:$ED, \"<=5\")-U16","v":11},{"$f":"COUNTIFS(Data!$ED:$ED, \"> 5\")","v":3}]
[]
[]
[null,null,null,null,null,null,null,null,null,null,null,null,null,null,null,null,"NEAREST HEALTH FACILITY"]
[null,null,null,null,null,null,null,null,null,null,null,null,null,null,null,null,"State","Hospital","Clinic","Rural centre","Rural sub-centre","Referral centre","Other"]
[null,null,null,null,null,null,null,null,null,null,null,null,null,null,null,null,"All camps",{"$f":"COUNTIF(Data!$EV:$EV, R20)","v":57},{"$f":"COUNTIF(Data!$EV:$EV, S20)","v":50},{"$f":"COUNTIF(Data!$EV:$EV, T20)","v":11},{"$f":"COUNTIF(Data!$EV:$EV, U20)","v":5},{"$f":"COUNTIF(Data!$EV:$EV, V20)","v":0},{"$f":"COUNTIF(Data!$EV:$EV, W20)","v":1}]
[]
[null,null,null,null,null,null,null,null,null,null,null,null,null,null,null,null,"CAMPS WITHOUT ESSENTIAL HEALTH SERVICES "]
[null,null,null,null,null,null,null,null,null,null,null,null,null,null,null,null,"State","Townships","Staff regularly available  for camp residents",null,null,"Health services regularly available  for camp residents"]
[null,null,null,null,null,null,null,null,null,null,null,null,null,null,null,null,null,null,"Doctors","Nurses","Midwives","Vaccination","Preventive health care","Pre&Post natal care","Reproductive health care","Reproductive health care ","Psychosocial support services "]
[null,null,null,null,null,null,null,null,null,null,null,null,null,null,null,null,"Kachin","Momauk",{"$f":"COUNTIFS(Data!$R:$R,$R26,Data!EX:EX,\"No\")","v":7},{"$f":"COUNTIFS(Data!$R:$R,$R26,Data!EY:EY,\"No\")","v":8},{"$f":"COUNTIFS(Data!$R:$R,$R26,Data!EZ:EZ,\"No\")","v":8},{"$f":"COUNTIFS(Data!$R:$R,$R26,Data!FA:FA,\"No\")","v":9},{"$f":"COUNTIFS(Data!$R:$R,$R26,Data!FB:FB,\"No\")","v":7},{"$f":"COUNTIFS(Data!$R:$R,$R26,Data!FC:FC,\"No\")","v":7},{"$f":"COUNTIFS(Data!$R:$R,$R26,Data!FD:FD,\"No\")","v":7},{"$f":"COUNTIFS(Data!$R:$R,$R26,Data!FE:FE,\"No\")","v":5},{"$f":"COUNTIFS(Data!$R:$R,$R26,Data!FF:FF,\"No\")","v":10}]
[null,null,null,null,null,null,null,null,null,null,null,null,null,null,null,null,null,"Mogaung",{"$f":"COUNTIFS(Data!$R:$R,$R27,Data!EX:EX,\"No\")","v":3},{"$f":"COUNTIFS(Data!$R:$R,$R27,Data!EY:EY,\"No\")","v":2},{"$f":"COUNTIFS(Data!$R:$R,$R27,Data!EZ:EZ,\"No\")","v":2},{"$f":"COUNTIFS(Data!$R:$R,$R27,Data!FA:FA,\"No\")","v":2},{"$f":"COUNTIFS(Data!$R:$R,$R27,Data!FB:FB,\"No\")","v":3},{"$f":"COUNTIFS(Data!$R:$R,$R27,Data!FC:FC,\"No\")","v":3},{"$f":"COUNTIFS(Data!$R:$R,$R27,Data!FD:FD,\"No\")","v":3},{"$f":"COUNTIFS(Data!$R:$R,$R27,Data!FE:FE,\"No\")","v":3},{"$f":"COUNTIFS(Data!$R:$R,$R27,Data!FF:FF,\"No\")","v":3}]
[null,null,null,null,null,null,null,null,null,null,null,null,null,null,null,null,null,"Chipwi",{"$f":"COUNTIFS(Data!$R:$R,$R28,Data!EX:EX,\"No\")","v":2},{"$f":"COUNTIFS(Data!$R:$R,$R28,Data!EY:EY,\"No\")","v":0},{"$f":"COUNTIFS(Data!$R:$R,$R28,Data!EZ:EZ,\"No\")","v":2},{"$f":"COUNTIFS(Data!$R:$R,$R28,Data!FA:FA,\"No\")","v":3},{"$f":"COUNTIFS(Data!$R:$R,$R28,Data!FB:FB,\"No\")","v":2},{"$f":"COUNTIFS(Data!$R:$R,$R28,Data!FC:FC,\"No\")","v":3},{"$f":"COUNTIFS(Data!$R:$R,$R28,Data!FD:FD,\"No\")","v":2},{"$f":"COUNTIFS(Data!$R:$R,$R28,Data!FE:FE,\"No\")","v":2},{"$f":"COUNTIFS(Data!$R:$R,$R28,Data!FF:FF,\"No\")","v":3}]
[null,null,null,null,null,null,null,null,null,null,null,null,null,null,null,null,null,"Sumprabum",{"$f":"COUNTIFS(Data!$R:$R,$R29,Data!EX:EX,\"No\")","v":0},{"$f":"COUNTIFS(Data!$R:$R,$R29,Data!EY:EY,\"No\")","v":0},{"$f":"COUNTIFS(Data!$R:$R,$R29,Data!EZ:EZ,\"No\")","v":0},{"$f":"COUNTIFS(Data!$R:$R,$R29,Data!FA:FA,\"No\")","v":0},{"$f":"COUNTIFS(Data!$R:$R,$R29,Data!FB:FB,\"No\")","v":0},{"$f":"COUNTIFS(Data!$R:$R,$R29,Data!FC:FC,\"No\")","v":0},{"$f":"COUNTIFS(Data!$R:$R,$R29,Data!FD:FD,\"No\")","v":0},{"$f":"COUNTIFS(Data!$R:$R,$R29,Data!FE:FE,\"No\")","v":0},{"$f":"COUNTIFS(Data!$R:$R,$R29,Data!FF:FF,\"No\")","v":0}]
[null,null,null,null,null,null,null,null,null,null,null,null,null,null,null,null,null,"Nawngmun",{"$f":"COUNTIFS(Data!$R:$R,$R30,Data!EX:EX,\"No\")","v":0},{"$f":"COUNTIFS(Data!$R:$R,$R30,Data!EY:EY,\"No\")","v":0},{"$f":"COUNTIFS(Data!$R:$R,$R30,Data!EZ:EZ,\"No\")","v":0},{"$f":"COUNTIFS(Data!$R:$R,$R30,Data!FA:FA,\"No\")","v":0},{"$f":"COUNTIFS(Data!$R:$R,$R30,Data!FB:FB,\"No\")","v":0},{"$f":"COUNTIFS(Data!$R:$R,$R30,Data!FC:FC,\"No\")","v":0},{"$f":"COUNTIFS(Data!$R:$R,$R30,Data!FD:FD,\"No\")","v":0},{"$f":"COUNTIFS(Data!$R:$R,$R30,Data!FE:FE,\"No\")","v":0},{"$f":"COUNTIFS(Data!$R:$R,$R30,Data!FF:FF,\"No\")","v":0}]
[null,null,null,null,null,null,null,null,null,null,null,null,null,null,null,null,null,"Mansi",{"$f":"COUNTIFS(Data!$R:$R,$R31,Data!EX:EX,\"No\")","v":4},{"$f":"COUNTIFS(Data!$R:$R,$R31,Data!EY:EY,\"No\")","v":0},{"$f":"COUNTIFS(Data!$R:$R,$R31,Data!EZ:EZ,\"No\")","v":2},{"$f":"COUNTIFS(Data!$R:$R,$R31,Data!FA:FA,\"No\")","v":7},{"$f":"COUNTIFS(Data!$R:$R,$R31,Data!FB:FB,\"No\")","v":1},{"$f":"COUNTIFS(Data!$R:$R,$R31,Data!FC:FC,\"No\")","v":2},{"$f":"COUNTIFS(Data!$R:$R,$R31,Data!FD:FD,\"No\")","v":4},{"$f":"COUNTIFS(Data!$R:$R,$R31,Data!FE:FE,\"No\")","v":4},{"$f":"COUNTIFS(Data!$R:$R,$R31,Data!FF:FF,\"No\")","v":4}]
[null,null,null,null,null,null,null,null,null,null,null,null,null,null,null,null,null,"Myitkyina",{"$f":"COUNTIFS(Data!$R:$R,$R32,Data!EX:EX,\"No\")","v":18},{"$f":"COUNTIFS(Data!$R:$R,$R32,Data!EY:EY,\"No\")","v":7},{"$f":"COUNTIFS(Data!$R:$R,$R32,Data!EZ:EZ,\"No\")","v":9},{"$f":"COUNTIFS(Data!$R:$R,$R32,Data!FA:FA,\"No\")","v":20},{"$f":"COUNTIFS(Data!$R:$R,$R32,Data!FB:FB,\"No\")","v":8},{"$f":"COUNTIFS(Data!$R:$R,$R32,Data!FC:FC,\"No\")","v":10},{"$f":"COUNTIFS(Data!$R:$R,$R32,Data!FD:FD,\"No\")","v":13},{"$f":"COUNTIFS(Data!$R:$R,$R32,Data!FE:FE,\"No\")","v":12},{"$f":"COUNTIFS(Data!$R:$R,$R32,Data!FF:FF,\"No\")","v":15}]
[null,null,null,null,null,null,null,null,null,null,null,null,null,null,null,null,null,"Khaunglanhpu",{"$f":"COUNTIFS(Data!$R:$R,$R33,Data!EX:EX,\"No\")","v":0},{"$f":"COUNTIFS(Data!$R:$R,$R33,Data!EY:EY,\"No\")","v":0},{"$f":"COUNTIFS(Data!$R:$R,$R33,Data!EZ:EZ,\"No\")","v":0},{"$f":"COUNTIFS(Data!$R:$R,$R33,Data!FA:FA,\"No\")","v":0},{"$f":"COUNTIFS(Data!$R:$R,$R33,Data!FB:FB,\"No\")","v":0},{"$f":"COUNTIFS(Data!$R:$R,$R33,Data!FC:FC,\"No\")","v":0},{"$f":"COUNTIFS(Data!$R:$R,$R33,Data!FD:FD,\"No\")","v":0},{"$f":"COUNTIFS(Data!$R:$R,$R33,Data!FE:FE,\"No\")","v":0},{"$f":"COUNTIFS(Data!$R:$R,$R33,Data!FF:FF,\"No\")","v":0}]
[null,null,null,null,null,null,null,null,null,null,null,null,null,null,null,null,null,"Puta-O",{"$f":"COUNTIFS(Data!$R:$R,$R34,Data!EX:EX,\"No\")","v":0},{"$f":"COUNTIFS(Data!$R:$R,$R34,Data!EY:EY,\"No\")","v":0},{"$f":"COUNTIFS(Data!$R:$R,$R34,Data!EZ:EZ,\"No\")","v":0},{"$f":"COUNTIFS(Data!$R:$R,$R34,Data!FA:FA,\"No\")","v":0},{"$f":"COUNTIFS(Data!$R:$R,$R34,Data!FB:FB,\"No\")","v":0},{"$f":"COUNTIFS(Data!$R:$R,$R34,Data!FC:FC,\"No\")","v":0},{"$f":"COUNTIFS(Data!$R:$R,$R34,Data!FD:FD,\"No\")","v":0},{"$f":"COUNTIFS(Data!$R:$R,$R34,Data!FE:FE,\"No\")","v":0},{"$f":"COUNTIFS(Data!$R:$R,$R34,Data!FF:FF,\"No\")","v":0}]
[null,null,null,null,null,null,null,null,null,null,null,null,null,null,null,null,null,"Shwegu",{"$f":"COUNTIFS(Data!$R:$R,$R35,Data!EX:EX,\"No\")","v":0},{"$f":"COUNTIFS(Data!$R:$R,$R35,Data!EY:EY,\"No\")","v":0},{"$f":"COUNTIFS(Data!$R:$R,$R35,Data!EZ:EZ,\"No\")","v":1},{"$f":"COUNTIFS(Data!$R:$R,$R35,Data!FA:FA,\"No\")","v":1},{"$f":"COUNTIFS(Data!$R:$R,$R35,Data!FB:FB,\"No\")","v":0},{"$f":"COUNTIFS(Data!$R:$R,$R35,Data!FC:FC,\"No\")","v":0},{"$f":"COUNTIFS(Data!$R:$R,$R35,Data!FD:FD,\"No\")","v":1},{"$f":"COUNTIFS(Data!$R:$R,$R35,Data!FE:FE,\"No\")","v":0},{"$f":"COUNTIFS(Data!$R:$R,$R35,Data!FF:FF,\"No\")","v":0}]
[null,null,null,null,null,null,null,null,null,null,null,null,null,null,null,null,null,"Injangyang",{"$f":"COUNTIFS(Data!$R:$R,$R36,Data!EX:EX,\"No\")","v":0},{"$f":"COUNTIFS(Data!$R:$R,$R36,Data!EY:EY,\"No\")","v":0},{"$f":"COUNTIFS(Data!$R:$R,$R36,Data!EZ:EZ,\"No\")","v":0},{"$f":"COUNTIFS(Data!$R:$R,$R36,Data!FA:FA,\"No\")","v":0},{"$f":"COUNTIFS(Data!$R:$R,$R36,Data!FB:FB,\"No\")","v":0},{"$f":"COUNTIFS(Data!$R:$R,$R36,Data!FC:FC,\"No\")","v":0},{"$f":"COUNTIFS(Data!$R:$R,$R36,Data!FD:FD,\"No\")","v":0},{"$f":"COUNTIFS(Data!$R:$R,$R36,Data!FE:FE,\"No\")","v":0},{"$f":"COUNTIFS(Data!$R:$R,$R36,Data!FF:FF,\"No\")","v":0}]
[null,null,null,null,null,null,null,null,null,null,null,null,null,null,null,null,null,"Tanai",{"$f":"COUNTIFS(Data!$R:$R,$R37,Data!EX:EX,\"No\")","v":0},{"$f":"COUNTIFS(Data!$R:$R,$R37,Data!EY:EY,\"No\")","v":0},{"$f":"COUNTIFS(Data!$R:$R,$R37,Data!EZ:EZ,\"No\")","v":0},{"$f":"COUNTIFS(Data!$R:$R,$R37,Data!FA:FA,\"No\")","v":0},{"$f":"COUNTIFS(Data!$R:$R,$R37,Data!FB:FB,\"No\")","v":0},{"$f":"COUNTIFS(Data!$R:$R,$R37,Data!FC:FC,\"No\")","v":0},{"$f":"COUNTIFS(Data!$R:$R,$R37,Data!FD:FD,\"No\")","v":0},{"$f":"COUNTIFS(Data!$R:$R,$R37,Data!FE:FE,\"No\")","v":0},{"$f":"COUNTIFS(Data!$R:$R,$R37,Data!FF:FF,\"No\")","v":0}]
[null,null,null,null,null,null,null,null,null,null,null,null,null,null,null,null,null,"Bhamo",{"$f":"COUNTIFS(Data!$R:$R,$R38,Data!EX:EX,\"No\")","v":8},{"$f":"COUNTIFS(Data!$R:$R,$R38,Data!EY:EY,\"No\")","v":4},{"$f":"COUNTIFS(Data!$R:$R,$R38,Data!EZ:EZ,\"No\")","v":9},{"$f":"COUNTIFS(Data!$R:$R,$R38,Data!FA:FA,\"No\")","v":9},{"$f":"COUNTIFS(Data!$R:$R,$R38,Data!FB:FB,\"No\")","v":5},{"$f":"COUNTIFS(Data!$R:$R,$R38,Data!FC:FC,\"No\")","v":5},{"$f":"COUNTIFS(Data!$R:$R,$R38,Data!FD:FD,\"No\")","v":7},{"$f":"COUNTIFS(Data!$R:$R,$R38,Data!FE:FE,\"No\")","v":9},{"$f":"COUNTIFS(Data!$R:$R,$R38,Data!FF:FF,\"No\")","v":6}]
[null,null,null,null,null,null,null,null,null,null,null,null,null,null,null,null,null,"Mohnyin",{"$f":"COUNTIFS(Data!$R:$R,$R39,Data!EX:EX,\"No\")","v":1},{"$f":"COUNTIFS(Data!$R:$R,$R39,Data!EY:EY,\"No\")","v":0},{"$f":"COUNTIFS(Data!$R:$R,$R39,Data!EZ:EZ,\"No\")","v":0},{"$f":"COUNTIFS(Data!$R:$R,$R39,Data!FA:FA,\"No\")","v":1},{"$f":"COUNTIFS(Data!$R:$R,$R39,Data!FB:FB,\"No\")","v":0},{"$f":"COUNTIFS(Data!$R:$R,$R39,Data!FC:FC,\"No\")","v":1},{"$f":"COUNTIFS(Data!$R:$R,$R39,Data!FD:FD,\"No\")","v":1},{"$f":"COUNTIFS(Data!$R:$R,$R39,Data!FE:FE,\"No\")","v":1},{"$f":"COUNTIFS(Data!$R:$R,$R39,Data!FF:FF,\"No\")","v":1}]
[null,null,null,null,null,null,null,null,null,null,null,null,null,null,null,null,null,"Waingmaw",{"$f":"COUNTIFS(Data!$R:$R,$R40,Data!EX:EX,\"No\")","v":14},{"$f":"COUNTIFS(Data!$R:$R,$R40,Data!EY:EY,\"No\")","v":6},{"$f":"COUNTIFS(Data!$R:$R,$R40,Data!EZ:EZ,\"No\")","v":15},{"$f":"COUNTIFS(Data!$R:$R,$R40,Data!FA:FA,\"No\")","v":15},{"$f":"COUNTIFS(Data!$R:$R,$R40,Data!FB:FB,\"No\")","v":5},{"$f":"COUNTIFS(Data!$R:$R,$R40,Data!FC:FC,\"No\")","v":13},{"$f":"COUNTIFS(Data!$R:$R,$R40,Data!FD:FD,\"No\")","v":11},{"$f":"COUNTIFS(Data!$R:$R,$R40,Data!FE:FE,\"No\")","v":15},{"$f":"COUNTIFS(Data!$R:$R,$R40,Data!FF:FF,\"No\")","v":14}]
[null,null,null,null,null,null,null,null,null,null,null,null,null,null,null,null,null,"Tsawlaw",{"$f":"COUNTIFS(Data!$R:$R,$R41,Data!EX:EX,\"No\")","v":0},{"$f":"COUNTIFS(Data!$R:$R,$R41,Data!EY:EY,\"No\")","v":0},{"$f":"COUNTIFS(Data!$R:$R,$R41,Data!EZ:EZ,\"No\")","v":0},{"$f":"COUNTIFS(Data!$R:$R,$R41,Data!FA:FA,\"No\")","v":0},{"$f":"COUNTIFS(Data!$R:$R,$R41,Data!FB:FB,\"No\")","v":0},{"$f":"COUNTIFS(Data!$R:$R,$R41,Data!FC:FC,\"No\")","v":0},{"$f":"COUNTIFS(Data!$R:$R,$R41,Data!FD:FD,\"No\")","v":0},{"$f":"COUNTIFS(Data!$R:$R,$R41,Data!FE:FE,\"No\")","v":0},{"$f":"COUNTIFS(Data!$R:$R,$R41,Data!FF:FF,\"No\")","v":0}]
[null,null,null,null,null,null,null,null,null,null,null,null,null,null,null,null,null,"Machanbaw",{"$f":"COUNTIFS(Data!$R:$R,$R42,Data!EX:EX,\"No\")","v":0},{"$f":"COUNTIFS(Data!$R:$R,$R42,Data!EY:EY,\"No\")","v":0},{"$f":"COUNTIFS(Data!$R:$R,$R42,Data!EZ:EZ,\"No\")","v":0},{"$f":"COUNTIFS(Data!$R:$R,$R42,Data!FA:FA,\"No\")","v":0},{"$f":"COUNTIFS(Data!$R:$R,$R42,Data!FB:FB,\"No\")","v":0},{"$f":"COUNTIFS(Data!$R:$R,$R42,Data!FC:FC,\"No\")","v":0},{"$f":"COUNTIFS(Data!$R:$R,$R42,Data!FD:FD,\"No\")","v":0},{"$f":"COUNTIFS(Data!$R:$R,$R42,Data!FE:FE,\"No\")","v":0},{"$f":"COUNTIFS(Data!$R:$R,$R42,Data!FF:FF,\"No\")","v":0}]
[null,null,null,null,null,null,null,null,null,null,null,null,null,null,null,null,null,"Hpakant",{"$f":"COUNTIFS(Data!$R:$R,$R43,Data!EX:EX,\"No\")","v":20},{"$f":"COUNTIFS(Data!$R:$R,$R43,Data!EY:EY,\"No\")","v":18},{"$f":"COUNTIFS(Data!$R:$R,$R43,Data!EZ:EZ,\"No\")","v":20},{"$f":"COUNTIFS(Data!$R:$R,$R43,Data!FA:FA,\"No\")","v":18},{"$f":"COUNTIFS(Data!$R:$R,$R43,Data!FB:FB,\"No\")","v":20},{"$f":"COUNTIFS(Data!$R:$R,$R43,Data!FC:FC,\"No\")","v":22},{"$f":"COUNTIFS(Data!$R:$R,$R43,Data!FD:FD,\"No\")","v":22},{"$f":"COUNTIFS(Data!$R:$R,$R43,Data!FE:FE,\"No\")","v":20},{"$f":"COUNTIFS(Data!$R:$R,$R43,Data!FF:FF,\"No\")","v":21}]
[null,null,null,null,null,null,null,null,null,null,null,null,null,null,null,null,null,"TOTALS",{"$f":"SUM(S26:S43)","v":77},{"$f":"SUM(T26:T43)","v":45},68,85,51,66,71,71,77]
[null,null,null,null,null,null,null,null,null,null,null,null,null,null,null,null,"Shan (North)","Namphan",{"$f":"COUNTIFS(Data!$R:$R,$R45,Data!EX:EX,\"No\")","v":0},{"$f":"COUNTIFS(Data!$R:$R,$R45,Data!EY:EY,\"No\")","v":0},{"$f":"COUNTIFS(Data!$R:$R,$R45,Data!EZ:EZ,\"No\")","v":0},{"$f":"COUNTIFS(Data!$R:$R,$R45,Data!FA:FA,\"No\")","v":0},{"$f":"COUNTIFS(Data!$R:$R,$R45,Data!FB:FB,\"No\")","v":0},{"$f":"COUNTIFS(Data!$R:$R,$R45,Data!FC:FC,\"No\")","v":0},{"$f":"COUNTIFS(Data!$R:$R,$R45,Data!FD:FD,\"No\")","v":0},{"$f":"COUNTIFS(Data!$R:$R,$R45,Data!FE:FE,\"No\")","v":0},{"$f":"COUNTIFS(Data!$R:$R,$R45,Data!FF:FF,\"No\")","v":0}]
[null,null,null,null,null,null,null,null,null,null,null,null,null,null,null,null,null,"Nawnghkio",{"$f":"COUNTIFS(Data!$R:$R,$R46,Data!EX:EX,\"No\")","v":0},{"$f":"COUNTIFS(Data!$R:$R,$R46,Data!EY:EY,\"No\")","v":0},{"$f":"COUNTIFS(Data!$R:$R,$R46,Data!EZ:EZ,\"No\")","v":0},{"$f":"COUNTIFS(Data!$R:$R,$R46,Data!FA:FA,\"No\")","v":0},{"$f":"COUNTIFS(Data!$R:$R,$R46,Data!FB:FB,\"No\")","v":0},{"$f":"COUNTIFS(Data!$R:$R,$R46,Data!FC:FC,\"No\")","v":0},{"$f":"COUNTIFS(Data!$R:$R,$R46,Data!FD:FD,\"No\")","v":0},{"$f":"COUNTIFS(Data!$R:$R,$R46,Data!FE:FE,\"No\")","v":0},{"$f":"COUNTIFS(Data!$R:$R,$R46,Data!FF:FF,\"No\")","v":0}]
[null,null,null,null,null,null,null,null,null,null,null,null,null,null,null,null,null,"Mongyai",{"$f":"COUNTIFS(Data!$R:$R,$R47,Data!EX:EX,\"No\")","v":0},{"$f":"COUNTIFS(Data!$R:$R,$R47,Data!EY:EY,\"No\")","v":0},{"$f":"COUNTIFS(Data!$R:$R,$R47,Data!EZ:EZ,\"No\")","v":0},{"$f":"COUNTIFS(Data!$R:$R,$R47,Data!FA:FA,\"No\")","v":0},{"$f":"COUNTIFS(Data!$R:$R,$R47,Data!FB:FB,\"No\")","v":0},{"$f":"COUNTIFS(Data!$R:$R,$R47,Data!FC:FC,\"No\")","v":0},{"$f":"COUNTIFS(Data!$R:$R,$R47,Data!FD:FD,\"No\")","v":0},{"$f":"COUNTIFS(Data!$R:$R,$R47,Data!FE:FE,\"No\")","v":0},{"$f":"COUNTIFS(Data!$R:$R,$R47,Data!FF:FF,\"No\")","v":0}]
[null,null,null,null,null,null,null,null,null,null,null,null,null,null,null,null,null,"Namhsan",{"$f":"COUNTIFS(Data!$R:$R,$R48,Data!EX:EX,\"No\")","v":0},{"$f":"COUNTIFS(Data!$R:$R,$R48,Data!EY:EY,\"No\")","v":0},{"$f":"COUNTIFS(Data!$R:$R,$R48,Data!EZ:EZ,\"No\")","v":0},{"$f":"COUNTIFS(Data!$R:$R,$R48,Data!FA:FA,\"No\")","v":0},{"$f":"COUNTIFS(Data!$R:$R,$R48,Data!FB:FB,\"No\")","v":0},{"$f":"COUNTIFS(Data!$R:$R,$R48,Data!FC:FC,\"No\")","v":0},{"$f":"COUNTIFS(Data!$R:$R,$R48,Data!FD:FD,\"No\")","v":0},{"$f":"COUNTIFS(Data!$R:$R,$R48,Data!FE:FE,\"No\")","v":0},{"$f":"COUNTIFS(Data!$R:$R,$R48,Data!FF:FF,\"No\")","v":0}]
[null,null,null,null,null,null,null,null,null,null,null,null,null,null,null,null,null,"Hseni",{"$f":"COUNTIFS(Data!$R:$R,$R49,Data!EX:EX,\"No\")","v":0},{"$f":"COUNTIFS(Data!$R:$R,$R49,Data!EY:EY,\"No\")","v":0},{"$f":"COUNTIFS(Data!$R:$R,$R49,Data!EZ:EZ,\"No\")","v":0},{"$f":"COUNTIFS(Data!$R:$R,$R49,Data!FA:FA,\"No\")","v":0},{"$f":"COUNTIFS(Data!$R:$R,$R49,Data!FB:FB,\"No\")","v":0},{"$f":"COUNTIFS(Data!$R:$R,$R49,Data!FC:FC,\"No\")","v":0},{"$f":"COUNTIFS(Data!$R:$R,$R49,Data!FD:FD,\"No\")","v":0},{"$f":"COUNTIFS(Data!$R:$R,$R49,Data!FE:FE,\"No\")","v":0},{"$f":"COUNTIFS(Data!$R:$R,$R49,Data!FF:FF,\"No\")","v":0}]
[null,null,null,null,null,null,null,null,null,null,null,null,null,null,null,null,null,"Laukkaing",{"$f":"COUNTIFS(Data!$R:$R,$R50,Data!EX:EX,\"No\")","v":0},{"$f":"COUNTIFS(Data!$R:$R,$R50,Data!EY:EY,\"No\")","v":0},{"$f":"COUNTIFS(Data!$R:$R,$R50,Data!EZ:EZ,\"No\")","v":0},{"$f":"COUNTIFS(Data!$R:$R,$R50,Data!FA:FA,\"No\")","v":0},{"$f":"COUNTIFS(Data!$R:$R,$R50,Data!FB:FB,\"No\")","v":0},{"$f":"COUNTIFS(Data!$R:$R,$R50,Data!FC:FC,\"No\")","v":0},{"$f":"COUNTIFS(Data!$R:$R,$R50,Data!FD:FD,\"No\")","v":0},{"$f":"COUNTIFS(Data!$R:$R,$R50,Data!FE:FE,\"No\")","v":0},{"$f":"COUNTIFS(Data!$R:$R,$R50,Data!FF:FF,\"No\")","v":0}]
[null,null,null,null,null,null,null,null,null,null,null,null,null,null,null,null,null,"Muse",{"$f":"COUNTIFS(Data!$R:$R,$R51,Data!EX:EX,\"No\")","v":1},{"$f":"COUNTIFS(Data!$R:$R,$R51,Data!EY:EY,\"No\")","v":0},{"$f":"COUNTIFS(Data!$R:$R,$R51,Data!EZ:EZ,\"No\")","v":0},{"$f":"COUNTIFS(Data!$R:$R,$R51,Data!FA:FA,\"No\")","v":1},{"$f":"COUNTIFS(Data!$R:$R,$R51,Data!FB:FB,\"No\")","v":1},{"$f":"COUNTIFS(Data!$R:$R,$R51,Data!FC:FC,\"No\")","v":1},{"$f":"COUNTIFS(Data!$R:$R,$R51,Data!FD:FD,\"No\")","v":1},{"$f":"COUNTIFS(Data!$R:$R,$R51,Data!FE:FE,\"No\")","v":1},{"$f":"COUNTIFS(Data!$R:$R,$R51,Data!FF:FF,\"No\")","v":1}]
[null,null,null,null,null,null,null,null,null,null,null,null,null,null,null,null,null,"Mabein",{"$f":"COUNTIFS(Data!$R:$R,$R52,Data!EX:EX,\"No\")","v":0},{"$f":"COUNTIFS(Data!$R:$R,$R52,Data!EY:EY,\"No\")","v":0},{"$f":"COUNTIFS(Data!$R:$R,$R52,Data!EZ:EZ,\"No\")","v":0},{"$f":"COUNTIFS(Data!$R:$R,$R52,Data!FA:FA,\"No\")","v":0},{"$f":"COUNTIFS(Data!$R:$R,$R52,Data!FB:FB,\"No\")","v":0},{"$f":"COUNTIFS(Data!$R:$R,$R52,Data!FC:FC,\"No\")","v":0},{"$f":"COUNTIFS(Data!$R:$R,$R52,Data!FD:FD,\"No\")","v":0},{"$f":"COUNTIFS(Data!$R:$R,$R52,Data!FE:FE,\"No\")","v":0},{"$f":"COUNTIFS(Data!$R:$R,$R52,Data!FF:FF,\"No\")","v":0}]
[null,null,null,null,null,null,null,null,null,null,null,null,null,null,null,null,null,"Kyaukme",{"$f":"COUNTIFS(Data!$R:$R,$R53,Data!EX:EX,\"No\")","v":0},{"$f":"COUNTIFS(Data!$R:$R,$R53,Data!EY:EY,\"No\")","v":0},{"$f":"COUNTIFS(Data!$R:$R,$R53,Data!EZ:EZ,\"No\")","v":0},{"$f":"COUNTIFS(Data!$R:$R,$R53,Data!FA:FA,\"No\")","v":0},{"$f":"COUNTIFS(Data!$R:$R,$R53,Data!FB:FB,\"No\")","v":0},{"$f":"COUNTIFS(Data!$R:$R,$R53,Data!FC:FC,\"No\")","v":0},{"$f":"COUNTIFS(Data!$R:$R,$R53,Data!FD:FD,\"No\")","v":0},{"$f":"COUNTIFS(Data!$R:$R,$R53,Data!FE:FE,\"No\")","v":0},{"$f":"COUNTIFS(Data!$R:$R,$R53,Data!FF:FF,\"No\")","v":0}]
[null,null,null,null,null,null,null,null,null,null,null,null,null,null,null,null,null,"Lashio",{"$f":"COUNTIFS(Data!$R:$R,$R54,Data!EX:EX,\"No\")","v":0},{"$f":"COUNTIFS(Data!$R:$R,$R54,Data!EY:EY,\"No\")","v":0},{"$f":"COUNTIFS(Data!$R:$R,$R54,Data!EZ:EZ,\"No\")","v":0},{"$f":"COUNTIFS(Data!$R:$R,$R54,Data!FA:FA,\"No\")","v":0},{"$f":"COUNTIFS(Data!$R:$R,$R54,Data!FB:FB,\"No\")","v":0},{"$f":"COUNTIFS(Data!$R:$R,$R54,Data!FC:FC,\"No\")","v":0},{"$f":"COUNTIFS(Data!$R:$R,$R54,Data!FD:FD,\"No\")","v":0},{"$f":"COUNTIFS(Data!$R:$R,$R54,Data!FE:FE,\"No\")","v":0},{"$f":"COUNTIFS(Data!$R:$R,$R54,Data!FF:FF,\"No\")","v":0}]
[null,null,null,null,null,null,null,null,null,null,null,null,null,null,null,null,null,"Kunlong",{"$f":"COUNTIFS(Data!$R:$R,$R55,Data!EX:EX,\"No\")","v":0},{"$f":"COUNTIFS(Data!$R:$R,$R55,Data!EY:EY,\"No\")","v":0},{"$f":"COUNTIFS(Data!$R:$R,$R55,Data!EZ:EZ,\"No\")","v":0},{"$f":"COUNTIFS(Data!$R:$R,$R55,Data!FA:FA,\"No\")","v":0},{"$f":"COUNTIFS(Data!$R:$R,$R55,Data!FB:FB,\"No\")","v":0},{"$f":"COUNTIFS(Data!$R:$R,$R55,Data!FC:FC,\"No\")","v":0},{"$f":"COUNTIFS(Data!$R:$R,$R55,Data!FD:FD,\"No\")","v":0},{"$f":"COUNTIFS(Data!$R:$R,$R55,Data!FE:FE,\"No\")","v":0},{"$f":"COUNTIFS(Data!$R:$R,$R55,Data!FF:FF,\"No\")","v":0}]
[null,null,null,null,null,null,null,null,null,null,null,null,null,null,null,null,null,"Matman",{"$f":"COUNTIFS(Data!$R:$R,$R56,Data!EX:EX,\"No\")","v":0},{"$f":"COUNTIFS(Data!$R:$R,$R56,Data!EY:EY,\"No\")","v":0},{"$f":"COUNTIFS(Data!$R:$R,$R56,Data!EZ:EZ,\"No\")","v":0},{"$f":"COUNTIFS(Data!$R:$R,$R56,Data!FA:FA,\"No\")","v":0},{"$f":"COUNTIFS(Data!$R:$R,$R56,Data!FB:FB,\"No\")","v":0},{"$f":"COUNTIFS(Data!$R:$R,$R56,Data!FC:FC,\"No\")","v":0},{"$f":"COUNTIFS(Data!$R:$R,$R56,Data!FD:FD,\"No\")","v":0},{"$f":"COUNTIFS(Data!$R:$R,$R56,Data!FE:FE,\"No\")","v":0},{"$f":"COUNTIFS(Data!$R:$R,$R56,Data!FF:FF,\"No\")","v":0}]
[null,null,null,null,null,null,null,null,null,null,null,null,null,null,null,null,null,"Namtu",{"$f":"COUNTIFS(Data!$R:$R,$R57,Data!EX:EX,\"No\")","v":1},{"$f":"COUNTIFS(Data!$R:$R,$R57,Data!EY:EY,\"No\")","v":0},{"$f":"COUNTIFS(Data!$R:$R,$R57,Data!EZ:EZ,\"No\")","v":0},{"$f":"COUNTIFS(Data!$R:$R,$R57,Data!FA:FA,\"No\")","v":1},{"$f":"COUNTIFS(Data!$R:$R,$R57,Data!FB:FB,\"No\")","v":0},{"$f":"COUNTIFS(Data!$R:$R,$R57,Data!FC:FC,\"No\")","v":1},{"$f":"COUNTIFS(Data!$R:$R,$R57,Data!FD:FD,\"No\")","v":1},{"$f":"COUNTIFS(Data!$R:$R,$R57,Data!FE:FE,\"No\")","v":1},{"$f":"COUNTIFS(Data!$R:$R,$R57,Data!FF:FF,\"No\")","v":1}]
[null,null,null,null,null,null,null,null,null,null,null,null,null,null,null,null,null,"Mongmit",{"$f":"COUNTIFS(Data!$R:$R,$R58,Data!EX:EX,\"No\")","v":0},{"$f":"COUNTIFS(Data!$R:$R,$R58,Data!EY:EY,\"No\")","v":0},{"$f":"COUNTIFS(Data!$R:$R,$R58,Data!EZ:EZ,\"No\")","v":0},{"$f":"COUNTIFS(Data!$R:$R,$R58,Data!FA:FA,\"No\")","v":0},{"$f":"COUNTIFS(Data!$R:$R,$R58,Data!FB:FB,\"No\")","v":0},{"$f":"COUNTIFS(Data!$R:$R,$R58,Data!FC:FC,\"No\")","v":0},{"$f":"COUNTIFS(Data!$R:$R,$R58,Data!FD:FD,\"No\")","v":0},{"$f":"COUNTIFS(Data!$R:$R,$R58,Data!FE:FE,\"No\")","v":0},{"$f":"COUNTIFS(Data!$R:$R,$R58,Data!FF:FF,\"No\")","v":0}]
[null,null,null,null,null,null,null,null,null,null,null,null,null,null,null,null,null,"Kutkai",{"$f":"COUNTIFS(Data!$R:$R,$R59,Data!EX:EX,\"No\")","v":6},{"$f":"COUNTIFS(Data!$R:$R,$R59,Data!EY:EY,\"No\")","v":4},{"$f":"COUNTIFS(Data!$R:$R,$R59,Data!EZ:EZ,\"No\")","v":3},{"$f":"COUNTIFS(Data!$R:$R,$R59,Data!FA:FA,\"No\")","v":7},{"$f":"COUNTIFS(Data!$R:$R,$R59,Data!FB:FB,\"No\")","v":1},{"$f":"COUNTIFS(Data!$R:$R,$R59,Data!FC:FC,\"No\")","v":5},{"$f":"COUNTIFS(Data!$R:$R,$R59,Data!FD:FD,\"No\")","v":5},{"$f":"COUNTIFS(Data!$R:$R,$R59,Data!FE:FE,\"No\")","v":7},{"$f":"COUNTIFS(Data!$R:$R,$R59,Data!FF:FF,\"No\")","v":5}]
[null,null,null,null,null,null,null,null,null,null,null,null,null,null,null,null,null,"Hsipaw",{"$f":"COUNTIFS(Data!$R:$R,$R60,Data!EX:EX,\"No\")","v":0},{"$f":"COUNTIFS(Data!$R:$R,$R60,Data!EY:EY,\"No\")","v":0},{"$f":"COUNTIFS(Data!$R:$R,$R60,Data!EZ:EZ,\"No\")","v":0},{"$f":"COUNTIFS(Data!$R:$R,$R60,Data!FA:FA,\"No\")","v":0},{"$f":"COUNTIFS(Data!$R:$R,$R60,Data!FB:FB,\"No\")","v":0},{"$f":"COUNTIFS(Data!$R:$R,$R60,Data!FC:FC,\"No\")","v":0},{"$f":"COUNTIFS(Data!$R:$R,$R60,Data!FD:FD,\"No\")","v":0},{"$f":"COUNTIFS(Data!$R:$R,$R60,Data!FE:FE,\"No\")","v":0},{"$f":"COUNTIFS(Data!$R:$R,$R60,Data!FF:FF,\"No\")","v":0}]
[null,null,null,null,null,null,null,null,null,null,null,null,null,null,null,null,null,"Pangsang",{"$f":"COUNTIFS(Data!$R:$R,$R61,Data!EX:EX,\"No\")","v":0},{"$f":"COUNTIFS(Data!$R:$R,$R61,Data!EY:EY,\"No\")","v":0},{"$f":"COUNTIFS(Data!$R:$R,$R61,Data!EZ:EZ,\"No\")","v":0},{"$f":"COUNTIFS(Data!$R:$R,$R61,Data!FA:FA,\"No\")","v":0},{"$f":"COUNTIFS(Data!$R:$R,$R61,Data!FB:FB,\"No\")","v":0},{"$f":"COUNTIFS(Data!$R:$R,$R61,Data!FC:FC,\"No\")","v":0},{"$f":"COUNTIFS(Data!$R:$R,$R61,Data!FD:FD,\"No\")","v":0},{"$f":"COUNTIFS(Data!$R:$R,$R61,Data!FE:FE,\"No\")","v":0},{"$f":"COUNTIFS(Data!$R:$R,$R61,Data!FF:FF,\"No\")","v":0}]
[null,null,null,null,null,null,null,null,null,null,null,null,null,null,null,null,null,"Pangwaun",{"$f":"COUNTIFS(Data!$R:$R,$R62,Data!EX:EX,\"No\")","v":0},{"$f":"COUNTIFS(Data!$R:$R,$R62,Data!EY:EY,\"No\")","v":0},{"$f":"COUNTIFS(Data!$R:$R,$R62,Data!EZ:EZ,\"No\")","v":0},{"$f":"COUNTIFS(Data!$R:$R,$R62,Data!FA:FA,\"No\")","v":0},{"$f":"COUNTIFS(Data!$R:$R,$R62,Data!FB:FB,\"No\")","v":0},{"$f":"COUNTIFS(Data!$R:$R,$R62,Data!FC:FC,\"No\")","v":0},{"$f":"COUNTIFS(Data!$R:$R,$R62,Data!FD:FD,\"No\")","v":0},{"$f":"COUNTIFS(Data!$R:$R,$R62,Data!FE:FE,\"No\")","v":0},{"$f":"COUNTIFS(Data!$R:$R,$R62,Data!FF:FF,\"No\")","v":0}]
[null,null,null,null,null,null,null,null,null,null,null,null,null,null,null,null,null,"Hopang",{"$f":"COUNTIFS(Data!$R:$R,$R63,Data!EX:EX,\"No\")","v":0},{"$f":"COUNTIFS(Data!$R:$R,$R63,Data!EY:EY,\"No\")","v":0},{"$f":"COUNTIFS(Data!$R:$R,$R63,Data!EZ:EZ,\"No\")","v":0},{"$f":"COUNTIFS(Data!$R:$R,$R63,Data!FA:FA,\"No\")","v":0},{"$f":"COUNTIFS(Data!$R:$R,$R63,Data!FB:FB,\"No\")","v":0},{"$f":"COUNTIFS(Data!$R:$R,$R63,Data!FC:FC,\"No\")","v":0},{"$f":"COUNTIFS(Data!$R:$R,$R63,Data!FD:FD,\"No\")","v":0},{"$f":"COUNTIFS(Data!$R:$R,$R63,Data!FE:FE,\"No\")","v":0},{"$f":"COUNTIFS(Data!$R:$R,$R63,Data!FF:FF,\"No\")","v":0}]
[null,null,null,null,null,null,null,null,null,null,null,null,null,null,null,null,null,"Manton",{"$f":"COUNTIFS(Data!$R:$R,$R64,Data!EX:EX,\"No\")","v":0},{"$f":"COUNTIFS(Data!$R:$R,$R64,Data!EY:EY,\"No\")","v":0},{"$f":"COUNTIFS(Data!$R:$R,$R64,Data!EZ:EZ,\"No\")","v":0},{"$f":"COUNTIFS(Data!$R:$R,$R64,Data!FA:FA,\"No\")","v":1},{"$f":"COUNTIFS(Data!$R:$R,$R64,Data!FB:FB,\"No\")","v":0},{"$f":"COUNTIFS(Data!$R:$R,$R64,Data!FC:FC,\"No\")","v":1},{"$f":"COUNTIFS(Data!$R:$R,$R64,Data!FD:FD,\"No\")","v":1},{"$f":"COUNTIFS(Data!$R:$R,$R64,Data!FE:FE,\"No\")","v":1},{"$f":"COUNTIFS(Data!$R:$R,$R64,Data!FF:FF,\"No\")","v":1}]
[null,null,null,null,null,null,null,null,null,null,null,null,null,null,null,null,null,"Konkyan",{"$f":"COUNTIFS(Data!$R:$R,$R65,Data!EX:EX,\"No\")","v":0},{"$f":"COUNTIFS(Data!$R:$R,$R65,Data!EY:EY,\"No\")","v":0},{"$f":"COUNTIFS(Data!$R:$R,$R65,Data!EZ:EZ,\"No\")","v":0},{"$f":"COUNTIFS(Data!$R:$R,$R65,Data!FA:FA,\"No\")","v":0},{"$f":"COUNTIFS(Data!$R:$R,$R65,Data!FB:FB,\"No\")","v":0},{"$f":"COUNTIFS(Data!$R:$R,$R65,Data!FC:FC,\"No\")","v":0},{"$f":"COUNTIFS(Data!$R:$R,$R65,Data!FD:FD,\"No\")","v":0},{"$f":"COUNTIFS(Data!$R:$R,$R65,Data!FE:FE,\"No\")","v":0},{"$f":"COUNTIFS(Data!$R:$R,$R65,Data!FF:FF,\"No\")","v":0}]
[null,null,null,null,null,null,null,null,null,null,null,null,null,null,null,null,null,"Tangyan",{"$f":"COUNTIFS(Data!$R:$R,$R66,Data!EX:EX,\"No\")","v":0},{"$f":"COUNTIFS(Data!$R:$R,$R66,Data!EY:EY,\"No\")","v":0},{"$f":"COUNTIFS(Data!$R:$R,$R66,Data!EZ:EZ,\"No\")","v":0},{"$f":"COUNTIFS(Data!$R:$R,$R66,Data!FA:FA,\"No\")","v":0},{"$f":"COUNTIFS(Data!$R:$R,$R66,Data!FB:FB,\"No\")","v":0},{"$f":"COUNTIFS(Data!$R:$R,$R66,Data!FC:FC,\"No\")","v":0},{"$f":"COUNTIFS(Data!$R:$R,$R66,Data!FD:FD,\"No\")","v":0},{"$f":"COUNTIFS(Data!$R:$R,$R66,Data!FE:FE,\"No\")","v":0},{"$f":"COUNTIFS(Data!$R:$R,$R66,Data!FF:FF,\"No\")","v":0}]
[null,null,null,null,null,null,null,null,null,null,null,null,null,null,null,null,null,"Namhkan",{"$f":"COUNTIFS(Data!$R:$R,$R67,Data!EX:EX,\"No\")","v":4},{"$f":"COUNTIFS(Data!$R:$R,$R67,Data!EY:EY,\"No\")","v":2},{"$f":"COUNTIFS(Data!$R:$R,$R67,Data!EZ:EZ,\"No\")","v":4},{"$f":"COUNTIFS(Data!$R:$R,$R67,Data!FA:FA,\"No\")","v":3},{"$f":"COUNTIFS(Data!$R:$R,$R67,Data!FB:FB,\"No\")","v":3},{"$f":"COUNTIFS(Data!$R:$R,$R67,Data!FC:FC,\"No\")","v":3},{"$f":"COUNTIFS(Data!$R:$R,$R67,Data!FD:FD,\"No\")","v":3},{"$f":"COUNTIFS(Data!$R:$R,$R67,Data!FE:FE,\"No\")","v":4},{"$f":"COUNTIFS(Data!$R:$R,$R67,Data!FF:FF,\"No\")","v":4}]
[null,null,null,null,null,null,null,null,null,null,null,null,null,null,null,null,null,"Mongmao",{"$f":"COUNTIFS(Data!$R:$R,$R68,Data!EX:EX,\"No\")","v":0},{"$f":"COUNTIFS(Data!$R:$R,$R68,Data!EY:EY,\"No\")","v":0},{"$f":"COUNTIFS(Data!$R:$R,$R68,Data!EZ:EZ,\"No\")","v":0},{"$f":"COUNTIFS(Data!$R:$R,$R68,Data!FA:FA,\"No\")","v":0},{"$f":"COUNTIFS(Data!$R:$R,$R68,Data!FB:FB,\"No\")","v":0},{"$f":"COUNTIFS(Data!$R:$R,$R68,Data!FC:FC,\"No\")","v":0},{"$f":"COUNTIFS(Data!$R:$R,$R68,Data!FD:FD,\"No\")","v":0},{"$f":"COUNTIFS(Data!$R:$R,$R68,Data!FE:FE,\"No\")","v":0},{"$f":"COUNTIFS(Data!$R:$R,$R68,Data!FF:FF,\"No\")","v":0}]
[null,null,null,null,null,null,null,null,null,null,null,null,null,null,null,null,null,"TOTALS",{"$f":"SUM(S45:S68)","v":12},{"$f":"SUM(T45:T68)","v":6},7,13,5,11,11,14,12]
[null,null,null,null,null,null,null,null,null,null,null,null,null,null,null,null,"OVERALL TOTALS",null,{"$f":"S69+S44","v":89},{"$f":"T69+T44","v":51},75,98,56,77,82,85,89]

{"sheet":"SHELTER & NFIs","index":13,"n_rows":69,"n_cols":33,"rows_kept":69,"cut":false,"hidden":false,"merged":[[57,21,57,22],[60,21,60,26],[3,21,3,31],[11,21,11,26],[13,21,31,21],[32,21,56,21]]}
[]
[]
[]
[null,null,null,null,null,null,null,null,null,null,null,null,null,null,null,null,null,null,null,null,null,"NUMBER OF FAMILIES THAT HAVE RECEIVED NFI SUPPORT"]
[null,null,null,null,null,null,null,null,null,null,null,null,null,null,null,null,null,null,null,null,null,"State","Number of Sites","Total Number of Households","Total Number of Individuals","Plastic Sheeting","Blankets","Mosquito Nets","Stoves","Lighting","Hygiene Kits","Kitchen Sets","Tool Kits"]
[null,null,null,null,null,null,null,null,null,null,null,null,null,null,null,null,null,null,null,null,null,"Kachin",{"$f":"COUNTIF(Data!Q:Q,V6)","v":110},{"$f":"SUMIF(Data!Q:Q,V6,Data!DG:DG)","v":13944},{"$f":"SUMIF(Data!Q:Q,V6,Data!DH:DH)","v":64047},{"$f":"IFERROR(SUMIF([1]Data!$M:$M,$V6,[1]Data!DA:DA)/$W6/100*$X6,0)","v":0},{"$f":"IFERROR(SUMIF([1]Data!$M:$M,$V6,[1]Data!DB:DB)/$W6/100*$X6,0)","v":0},{"$f":"IFERROR(SUMIF([1]Data!$M:$M,$V6,[1]Data!DC:DC)/$W6/100*$X6,0)","v":0},{"$f":"IFERROR(SUMIF([1]Data!$M:$M,$V6,[1]Data!DD:DD)/$W6/100*$X6,0)","v":0},{"$f":"IFERROR(SUMIF([1]Data!$M:$M,$V6,[1]Data!DE:DE)/$W6/100*$X6,0)","v":0},{"$f":"IFERROR(SUMIF([1]Data!$M:$M,$V6,[1]Data!DF:DF)/$W6/100*$X6,0)","v":0},{"$f":"IFERROR(SUMIF([1]Data!$M:$M,$V6,[1]Data!DG:DG)/$W6/100*$X6,0)","v":0},{"$f":"IFERROR(SUMIF([1]Data!$M:$M,$V6,[1]Data!DH:DH)/$W6/100*$X6,0)","v":0}]
[null,null,null,null,null,null,null,null,null,null,null,null,null,null,null,null,null,null,null,null,null,"Shan (North)",{"$f":"COUNTIF(Data!Q:Q,V7)","v":16},{"$f":"SUMIF(Data!Q:Q,V7,Data!DG:DG)","v":866},{"$f":"SUMIF(Data!Q:Q,V7,Data!DH:DH)","v":4005},{"$f":"IFERROR(SUMIF([1]Data!$M:$M,$V7,[1]Data!DA:DA)/$W7/100*$X7,0)","v":0},{"$f":"IFERROR(SUMIF([1]Data!$M:$M,$V7,[1]Data!DB:DB)/$W7/100*$X7,0)","v":0},{"$f":"IFERROR(SUMIF([1]Data!$M:$M,$V7,[1]Data!DC:DC)/$W7/100*$X7,0)","v":0},{"$f":"IFERROR(SUMIF([1]Data!$M:$M,$V7,[1]Data!DD:DD)/$W7/100*$X7,0)","v":0},{"$f":"IFERROR(SUMIF([1]Data!$M:$M,$V7,[1]Data!DE:DE)/$W7/100*$X7,0)","v":0},{"$f":"IFERROR(SUMIF([1]Data!$M:$M,$V7,[1]Data!DF:DF)/$W7/100*$X7,0)","v":0},{"$f":"IFERROR(SUMIF([1]Data!$M:$M,$V7,[1]Data!DG:DG)/$W7/100*$X7,0)","v":0},{"$f":"IFERROR(SUMIF([1]Data!$M:$M,$V7,[1]Data!DH:DH)/$W7/100*$X7,0)","v":0}]
[null,null,null,null,null,null,null,null,null,null,null,null,null,null,null,null,null,null,null,null,null,"TOTALS",{"$f":"SUM(W6:W7)","v":126},14810,68052,0,0,0,0,0,0,0,0]
[null,null,null,null,null,null,null,null,null,null,null,null,null,null,null,null,null,null,null,null,null,"Distributed",null,null,null,{"$f":"Z8/$X$8","v":0},0,0,0,0,0,0,0]
[null,null,null,null,null,null,null,null,null,null,null,null,null,null,null,null,null,null,null,null,null,"Remaining",null,null,null,{"$f":"100%-Z9","v":1},{"$f":"100%-AA9","v":1},1,1,1,1,1,1]
[]
[null,null,null,null,null,null,null,null,null,null,null,null,null,null,null,null,null,null,null,null,null,"SHELTER COMPOSITION"]
[null,null,null,null,null,null,null,null,null,null,null,null,null,null,null,null,null,null,null,null,null,"State","Townships","Number of Sites","Total Number of Families","Open space (without roof/wall)","Make-shift shelters ","Community/religious building","Solid shelters"]
[null,null,null,null,null,null,null,null,null,null,null,null,null,null,null,null,null,null,null,null,null,"Kachin","Momauk",{"$f":"COUNTIF(Data!R:R,W14)","v":14},{"$f":"SUMIF(Data!R:R,W14,Data!DG:DG)","v":4066},{"$f":"COUNTIFS(Data!$R:$R,$W14,Data!$EK:$EK,'SHELTER & NFIs'!$Z$13)","v":0},{"$f":"COUNTIFS(Data!$R:$R,$W14,Data!$EK:$EK,'SHELTER & NFIs'!$AA$13)","v":0},{"$f":"COUNTIFS(Data!$R:$R,$W14,Data!$EK:$EK,'SHELTER & NFIs'!$AB$13)","v":0},{"$f":"COUNTIFS(Data!$R:$R,$W14,Data!$EK:$EK,'SHELTER & NFIs'!$AC$13)","v":13}]
[null,null,null,null,null,null,null,null,null,null,null,null,null,null,null,null,null,null,null,null,null,null,"Mogaung",{"$f":"COUNTIF(Data!R:R,W15)","v":3},{"$f":"SUMIF(Data!R:R,W15,Data!DG:DG)","v":39},{"$f":"COUNTIFS(Data!$R:$R,$W15,Data!$EK:$EK,'SHELTER & NFIs'!$Z$13)","v":0},{"$f":"COUNTIFS(Data!$R:$R,$W15,Data!$EK:$EK,'SHELTER & NFIs'!$AA$13)","v":0},{"$f":"COUNTIFS(Data!$R:$R,$W15,Data!$EK:$EK,'SHELTER & NFIs'!$AB$13)","v":0},{"$f":"COUNTIFS(Data!$R:$R,$W15,Data!$EK:$EK,'SHELTER & NFIs'!$AC$13)","v":3}]
[null,null,null,null,null,null,null,null,null,null,null,null,null,null,null,null,null,null,null,null,null,null,"Chipwi",{"$f":"COUNTIF(Data!R:R,W16)","v":3},{"$f":"SUMIF(Data!R:R,W16,Data!DG:DG)","v":382},{"$f":"COUNTIFS(Data!$R:$R,$W16,Data!$EK:$EK,'SHELTER & NFIs'!$Z$13)","v":0},{"$f":"COUNTIFS(Data!$R:$R,$W16,Data!$EK:$EK,'SHELTER & NFIs'!$AA$13)","v":0},{"$f":"COUNTIFS(Data!$R:$R,$W16,Data!$EK:$EK,'SHELTER & NFIs'!$AB$13)","v":0},{"$f":"COUNTIFS(Data!$R:$R,$W16,Data!$EK:$EK,'SHELTER & NFIs'!$AC$13)","v":3}]
[null,null,null,null,null,null,null,null,null,null,null,null,null,null,null,null,null,null,null,null,null,null,"Sumprabum",{"$f":"COUNTIF(Data!R:R,W17)","v":0},{"$f":"SUMIF(Data!R:R,W17,Data!DG:DG)","v":0},{"$f":"COUNTIFS(Data!$R:$R,$W17,Data!$EK:$EK,'SHELTER & NFIs'!$Z$13)","v":0},{"$f":"COUNTIFS(Data!$R:$R,$W17,Data!$EK:$EK,'SHELTER & NFIs'!$AA$13)","v":0},{"$f":"COUNTIFS(Data!$R:$R,$W17,Data!$EK:$EK,'SHELTER & NFIs'!$AB$13)","v":0},{"$f":"COUNTIFS(Data!$R:$R,$W17,Data!$EK:$EK,'SHELTER & NFIs'!$AC$13)","v":0}]
[null,null,null,null,null,null,null,null,null,null,null,null,null,null,null,null,null,null,null,null,null,null,"Nawngmun",{"$f":"COUNTIF(Data!R:R,W18)","v":0},{"$f":"SUMIF(Data!R:R,W18,Data!DG:DG)","v":0},{"$f":"COUNTIFS(Data!$R:$R,$W18,Data!$EK:$EK,'SHELTER & NFIs'!$Z$13)","v":0},{"$f":"COUNTIFS(Data!$R:$R,$W18,Data!$EK:$EK,'SHELTER & NFIs'!$AA$13)","v":0},{"$f":"COUNTIFS(Data!$R:$R,$W18,Data!$EK:$EK,'SHELTER & NFIs'!$AB$13)","v":0},{"$f":"COUNTIFS(Data!$R:$R,$W18,Data!$EK:$EK,'SHELTER & NFIs'!$AC$13)","v":0}]
[null,null,null,null,null,null,null,null,null,null,null,null,null,null,null,null,null,null,null,null,null,null,"Mansi",{"$f":"COUNTIF(Data!R:R,W19)","v":9},{"$f":"SUMIF(Data!R:R,W19,Data!DG:DG)","v":1715},{"$f":"COUNTIFS(Data!$R:$R,$W19,Data!$EK:$EK,'SHELTER & NFIs'!$Z$13)","v":0},{"$f":"COUNTIFS(Data!$R:$R,$W19,Data!$EK:$EK,'SHELTER & NFIs'!$AA$13)","v":0},{"$f":"COUNTIFS(Data!$R:$R,$W19,Data!$EK:$EK,'SHELTER & NFIs'!$AB$13)","v":0},{"$f":"COUNTIFS(Data!$R:$R,$W19,Data!$EK:$EK,'SHELTER & NFIs'!$AC$13)","v":9}]
[null,null,null,null,null,null,null,null,null,null,null,null,null,null,null,null,null,null,null,null,null,null,"Myitkyina",{"$f":"COUNTIF(Data!R:R,W20)","v":25},{"$f":"SUMIF(Data!R:R,W20,Data!DG:DG)","v":1380},{"$f":"COUNTIFS(Data!$R:$R,$W20,Data!$EK:$EK,'SHELTER & NFIs'!$Z$13)","v":0},{"$f":"COUNTIFS(Data!$R:$R,$W20,Data!$EK:$EK,'SHELTER & NFIs'!$AA$13)","v":0},{"$f":"COUNTIFS(Data!$R:$R,$W20,Data!$EK:$EK,'SHELTER & NFIs'!$AB$13)","v":5},{"$f":"COUNTIFS(Data!$R:$R,$W20,Data!$EK:$EK,'SHELTER & NFIs'!$AC$13)","v":20}]
[null,null,null,null,null,null,null,null,null,null,null,null,null,null,null,null,null,null,null,null,null,null,"Khaunglanhpu",{"$f":"COUNTIF(Data!R:R,W21)","v":0},{"$f":"SUMIF(Data!R:R,W21,Data!DG:DG)","v":0},{"$f":"COUNTIFS(Data!$R:$R,$W21,Data!$EK:$EK,'SHELTER & NFIs'!$Z$13)","v":0},{"$f":"COUNTIFS(Data!$R:$R,$W21,Data!$EK:$EK,'SHELTER & NFIs'!$AA$13)","v":0},{"$f":"COUNTIFS(Data!$R:$R,$W21,Data!$EK:$EK,'SHELTER & NFIs'!$AB$13)","v":0},{"$f":"COUNTIFS(Data!$R:$R,$W21,Data!$EK:$EK,'SHELTER & NFIs'!$AC$13)","v":0}]
[null,null,null,null,null,null,null,null,null,null,null,null,null,null,null,null,null,null,null,null,null,null,"Puta-O",{"$f":"COUNTIF(Data!R:R,W22)","v":0},{"$f":"SUMIF(Data!R:R,W22,Data!DG:DG)","v":0},{"$f":"COUNTIFS(Data!$R:$R,$W22,Data!$EK:$EK,'SHELTER & NFIs'!$Z$13)","v":0},{"$f":"COUNTIFS(Data!$R:$R,$W22,Data!$EK:$EK,'SHELTER & NFIs'!$AA$13)","v":0},{"$f":"COUNTIFS(Data!$R:$R,$W22,Data!$EK:$EK,'SHELTER & NFIs'!$AB$13)","v":0},{"$f":"COUNTIFS(Data!$R:$R,$W22,Data!$EK:$EK,'SHELTER & NFIs'!$AC$13)","v":0}]
[null,null,null,null,null,null,null,null,null,null,null,null,null,null,null,null,null,null,null,null,null,null,"Shwegu",{"$f":"COUNTIF(Data!R:R,W23)","v":2},{"$f":"SUMIF(Data!R:R,W23,Data!DG:DG)","v":98},{"$f":"COUNTIFS(Data!$R:$R,$W23,Data!$EK:$EK,'SHELTER & NFIs'!$Z$13)","v":0},{"$f":"COUNTIFS(Data!$R:$R,$W23,Data!$EK:$EK,'SHELTER & NFIs'!$AA$13)","v":0},{"$f":"COUNTIFS(Data!$R:$R,$W23,Data!$EK:$EK,'SHELTER & NFIs'!$AB$13)","v":0},{"$f":"COUNTIFS(Data!$R:$R,$W23,Data!$EK:$EK,'SHELTER & NFIs'!$AC$13)","v":2}]
[null,null,null,null,null,null,null,null,null,null,null,null,null,null,null,null,null,null,null,null,null,null,"Injangyang",{"$f":"COUNTIF(Data!R:R,W24)","v":0},{"$f":"SUMIF(Data!R:R,W24,Data!DG:DG)","v":0},{"$f":"COUNTIFS(Data!$R:$R,$W24,Data!$EK:$EK,'SHELTER & NFIs'!$Z$13)","v":0},{"$f":"COUNTIFS(Data!$R:$R,$W24,Data!$EK:$EK,'SHELTER & NFIs'!$AA$13)","v":0},{"$f":"COUNTIFS(Data!$R:$R,$W24,Data!$EK:$EK,'SHELTER & NFIs'!$AB$13)","v":0},{"$f":"COUNTIFS(Data!$R:$R,$W24,Data!$EK:$EK,'SHELTER & NFIs'!$AC$13)","v":0}]
[null,null,null,null,null,null,null,null,null,null,null,null,null,null,null,null,null,null,null,null,null,null,"Tanai",{"$f":"COUNTIF(Data!R:R,W25)","v":0},{"$f":"SUMIF(Data!R:R,W25,Data!DG:DG)","v":0},{"$f":"COUNTIFS(Data!$R:$R,$W25,Data!$EK:$EK,'SHELTER & NFIs'!$Z$13)","v":0},{"$f":"COUNTIFS(Data!$R:$R,$W25,Data!$EK:$EK,'SHELTER & NFIs'!$AA$13)","v":0},{"$f":"COUNTIFS(Data!$R:$R,$W25,Data!$EK:$EK,'SHELTER & NFIs'!$AB$13)","v":0},{"$f":"COUNTIFS(Data!$R:$R,$W25,Data!$EK:$EK,'SHELTER & NFIs'!$AC$13)","v":0}]
[null,null,null,null,null,null,null,null,null,null,null,null,null,null,null,null,null,null,null,null,null,null,"Bhamo",{"$f":"COUNTIF(Data!R:R,W26)","v":10},{"$f":"SUMIF(Data!R:R,W26,Data!DG:DG)","v":935},{"$f":"COUNTIFS(Data!$R:$R,$W26,Data!$EK:$EK,'SHELTER & NFIs'!$Z$13)","v":0},{"$f":"COUNTIFS(Data!$R:$R,$W26,Data!$EK:$EK,'SHELTER & NFIs'!$AA$13)","v":0},{"$f":"COUNTIFS(Data!$R:$R,$W26,Data!$EK:$EK,'SHELTER & NFIs'!$AB$13)","v":2},{"$f":"COUNTIFS(Data!$R:$R,$W26,Data!$EK:$EK,'SHELTER & NFIs'!$AC$13)","v":7}]
[null,null,null,null,null,null,null,null,null,null,null,null,null,null,null,null,null,null,null,null,null,null,"Mohnyin",{"$f":"COUNTIF(Data!R:R,W27)","v":1},{"$f":"SUMIF(Data!R:R,W27,Data!DG:DG)","v":21},{"$f":"COUNTIFS(Data!$R:$R,$W27,Data!$EK:$EK,'SHELTER & NFIs'!$Z$13)","v":0},{"$f":"COUNTIFS(Data!$R:$R,$W27,Data!$EK:$EK,'SHELTER & NFIs'!$AA$13)","v":0},{"$f":"COUNTIFS(Data!$R:$R,$W27,Data!$EK:$EK,'SHELTER & NFIs'!$AB$13)","v":0},{"$f":"COUNTIFS(Data!$R:$R,$W27,Data!$EK:$EK,'SHELTER & NFIs'!$AC$13)","v":1}]
[null,null,null,null,null,null,null,null,null,null,null,null,null,null,null,null,null,null,null,null,null,null,"Waingmaw",{"$f":"COUNTIF(Data!R:R,W28)","v":21},{"$f":"SUMIF(Data!R:R,W28,Data!DG:DG)","v":4512},{"$f":"COUNTIFS(Data!$R:$R,$W28,Data!$EK:$EK,'SHELTER & NFIs'!$Z$13)","v":0},{"$f":"COUNTIFS(Data!$R:$R,$W28,Data!$EK:$EK,'SHELTER & NFIs'!$AA$13)","v":0},{"$f":"COUNTIFS(Data!$R:$R,$W28,Data!$EK:$EK,'SHELTER & NFIs'!$AB$13)","v":2},{"$f":"COUNTIFS(Data!$R:$R,$W28,Data!$EK:$EK,'SHELTER & NFIs'!$AC$13)","v":18}]
[null,null,null,null,null,null,null,null,null,null,null,null,null,null,null,null,null,null,null,null,null,null,"Tsawlaw",{"$f":"COUNTIF(Data!R:R,W29)","v":0},{"$f":"SUMIF(Data!R:R,W29,Data!DG:DG)","v":0},{"$f":"COUNTIFS(Data!$R:$R,$W29,Data!$EK:$EK,'SHELTER & NFIs'!$Z$13)","v":0},{"$f":"COUNTIFS(Data!$R:$R,$W29,Data!$EK:$EK,'SHELTER & NFIs'!$AA$13)","v":0},{"$f":"COUNTIFS(Data!$R:$R,$W29,Data!$EK:$EK,'SHELTER & NFIs'!$AB$13)","v":0},{"$f":"COUNTIFS(Data!$R:$R,$W29,Data!$EK:$EK,'SHELTER & NFIs'!$AC$13)","v":0}]
[null,null,null,null,null,null,null,null,null,null,null,null,null,null,null,null,null,null,null,null,null,null,"Machanbaw",{"$f":"COUNTIF(Data!R:R,W30)","v":0},{"$f":"SUMIF(Data!R:R,W30,Data!DG:DG)","v":0},{"$f":"COUNTIFS(Data!$R:$R,$W30,Data!$EK:$EK,'SHELTER & NFIs'!$Z$13)","v":0},{"$f":"COUNTIFS(Data!$R:$R,$W30,Data!$EK:$EK,'SHELTER & NFIs'!$AA$13)","v":0},{"$f":"COUNTIFS(Data!$R:$R,$W30,Data!$EK:$EK,'SHELTER & NFIs'!$AB$13)","v":0},{"$f":"COUNTIFS(Data!$R:$R,$W30,Data!$EK:$EK,'SHELTER & NFIs'!$AC$13)","v":0}]
[null,null,null,null,null,null,null,null,null,null,null,null,null,null,null,null,null,null,null,null,null,null,"Hpakant",{"$f":"COUNTIF(Data!R:R,W31)","v":22},{"$f":"SUMIF(Data!R:R,W31,Data!DG:DG)","v":796},{"$f":"COUNTIFS(Data!$R:$R,$W31,Data!$EK:$EK,'SHELTER & NFIs'!$Z$13)","v":0},{"$f":"COUNTIFS(Data!$R:$R,$W31,Data!$EK:$EK,'SHELTER & NFIs'!$AA$13)","v":0},{"$f":"COUNTIFS(Data!$R:$R,$W31,Data!$EK:$EK,'SHELTER & NFIs'!$AB$13)","v":8},{"$f":"COUNTIFS(Data!$R:$R,$W31,Data!$EK:$EK,'SHELTER & NFIs'!$AC$13)","v":14}]
[null,null,null,null,null,null,null,null,null,null,null,null,null,null,null,null,null,null,null,null,null,null,"TOTALS",{"$f":"SUM(X14:X31)","v":110},{"$f":"SUM(Y14:Y31)","v":13944},0,0,17,90]
[null,null,null,null,null,null,null,null,null,null,null,null,null,null,null,null,null,null,null,null,null,"Shan (North)","Namphan",{"$f":"COUNTIF(Data!R:R,W33)","v":0},{"$f":"SUMIF(Data!R:R,W33,Data!DG:DG)","v":0},{"$f":"COUNTIFS(Data!$R:$R,$W33,Data!$EK:$EK,'SHELTER & NFIs'!$Z$13)","v":0},{"$f":"COUNTIFS(Data!$R:$R,$W33,Data!$EK:$EK,'SHELTER & NFIs'!$AA$13)","v":0},{"$f":"COUNTIFS(Data!$R:$R,$W33,Data!$EK:$EK,'SHELTER & NFIs'!$AB$13)","v":0},{"$f":"COUNTIFS(Data!$R:$R,$W33,Data!$EK:$EK,'SHELTER & NFIs'!$AC$13)","v":0}]
[null,null,null,null,null,null,null,null,null,null,null,null,null,null,null,null,null,null,null,null,null,null,"Nawnghkio",{"$f":"COUNTIF(Data!R:R,W34)","v":0},{"$f":"SUMIF(Data!R:R,W34,Data!DG:DG)","v":0},{"$f":"COUNTIFS(Data!$R:$R,$W34,Data!$EK:$EK,'SHELTER & NFIs'!$Z$13)","v":0},{"$f":"COUNTIFS(Data!$R:$R,$W34,Data!$EK:$EK,'SHELTER & NFIs'!$AA$13)","v":0},{"$f":"COUNTIFS(Data!$R:$R,$W34,Data!$EK:$EK,'SHELTER & NFIs'!$AB$13)","v":0},{"$f":"COUNTIFS(Data!$R:$R,$W34,Data!$EK:$EK,'SHELTER & NFIs'!$AC$13)","v":0}]
[null,null,null,null,null,null,null,null,null,null,null,null,null,null,null,null,null,null,null,null,null,null,"Mongyai",{"$f":"COUNTIF(Data!R:R,W35)","v":0},{"$f":"SUMIF(Data!R:R,W35,Data!DG:DG)","v":0},{"$f":"COUNTIFS(Data!$R:$R,$W35,Data!$EK:$EK,'SHELTER & NFIs'!$Z$13)","v":0},{"$f":"COUNTIFS(Data!$R:$R,$W35,Data!$EK:$EK,'SHELTER & NFIs'!$AA$13)","v":0},{"$f":"COUNTIFS(Data!$R:$R,$W35,Data!$EK:$EK,'SHELTER & NFIs'!$AB$13)","v":0},{"$f":"COUNTIFS(Data!$R:$R,$W35,Data!$EK:$EK,'SHELTER & NFIs'!$AC$13)","v":0}]
[null,null,null,null,null,null,null,null,null,null,null,null,null,null,null,null,null,null,null,null,null,null,"Namhsan",{"$f":"COUNTIF(Data!R:R,W36)","v":0},{"$f":"SUMIF(Data!R:R,W36,Data!DG:DG)","v":0},{"$f":"COUNTIFS(Data!$R:$R,$W36,Data!$EK:$EK,'SHELTER & NFIs'!$Z$13)","v":0},{"$f":"COUNTIFS(Data!$R:$R,$W36,Data!$EK:$EK,'SHELTER & NFIs'!$AA$13)","v":0},{"$f":"COUNTIFS(Data!$R:$R,$W36,Data!$EK:$EK,'SHELTER & NFIs'!$AB$13)","v":0},{"$f":"COUNTIFS(Data!$R:$R,$W36,Data!$EK:$EK,'SHELTER & NFIs'!$AC$13)","v":0}]
[null,null,null,null,null,null,null,null,null,null,null,null,null,null,null,null,null,null,null,null,null,null,"Hseni",{"$f":"COUNTIF(Data!R:R,W37)","v":1},{"$f":"SUMIF(Data!R:R,W37,Data!DG:DG)","v":50},{"$f":"COUNTIFS(Data!$R:$R,$W37,Data!$EK:$EK,'SHELTER & NFIs'!$Z$13)","v":0},{"$f":"COUNTIFS(Data!$R:$R,$W37,Data!$EK:$EK,'SHELTER & NFIs'!$AA$13)","v":0},{"$f":"COUNTIFS(Data!$R:$R,$W37,Data!$EK:$EK,'SHELTER & NFIs'!$AB$13)","v":0},{"$f":"COUNTIFS(Data!$R:$R,$W37,Data!$EK:$EK,'SHELTER & NFIs'!$AC$13)","v":0}]
[null,null,null,null,null,null,null,null,null,null,null,null,null,null,null,null,null,null,null,null,null,null,"Laukkaing",{"$f":"COUNTIF(Data!R:R,W38)","v":0},{"$f":"SUMIF(Data!R:R,W38,Data!DG:DG)","v":0},{"$f":"COUNTIFS(Data!$R:$R,$W38,Data!$EK:$EK,'SHELTER & NFIs'!$Z$13)","v":0},{"$f":"COUNTIFS(Data!$R:$R,$W38,Data!$EK:$EK,'SHELTER & NFIs'!$AA$13)","v":0},{"$f":"COUNTIFS(Data!$R:$R,$W38,Data!$EK:$EK,'SHELTER & NFIs'!$AB$13)","v":0},{"$f":"COUNTIFS(Data!$R:$R,$W38,Data!$EK:$EK,'SHELTER & NFIs'!$AC$13)","v":0}]
[null,null,null,null,null,null,null,null,null,null,null,null,null,null,null,null,null,null,null,null,null,null,"Muse",{"$f":"COUNTIF(Data!R:R,W39)","v":1},{"$f":"SUMIF(Data!R:R,W39,Data!DG:DG)","v":27},{"$f":"COUNTIFS(Data!$R:$R,$W39,Data!$EK:$EK,'SHELTER & NFIs'!$Z$13)","v":0},{"$f":"COUNTIFS(Data!$R:$R,$W39,Data!$EK:$EK,'SHELTER & NFIs'!$AA$13)","v":0},{"$f":"COUNTIFS(Data!$R:$R,$W39,Data!$EK:$EK,'SHELTER & NFIs'!$AB$13)","v":1},{"$f":"COUNTIFS(Data!$R:$R,$W39,Data!$EK:$EK,'SHELTER & NFIs'!$AC$13)","v":0}]
[null,null,null,null,null,null,null,null,null,null,null,null,null,null,null,null,null,null,null,null,null,null,"Mabein",{"$f":"COUNTIF(Data!R:R,W40)","v":0},{"$f":"SUMIF(Data!R:R,W40,Data!DG:DG)","v":0},{"$f":"COUNTIFS(Data!$R:$R,$W40,Data!$EK:$EK,'SHELTER & NFIs'!$Z$13)","v":0},{"$f":"COUNTIFS(Data!$R:$R,$W40,Data!$EK:$EK,'SHELTER & NFIs'!$AA$13)","v":0},{"$f":"COUNTIFS(Data!$R:$R,$W40,Data!$EK:$EK,'SHELTER & NFIs'!$AB$13)","v":0},{"$f":"COUNTIFS(Data!$R:$R,$W40,Data!$EK:$EK,'SHELTER & NFIs'!$AC$13)","v":0}]
[null,null,null,null,null,null,null,null,null,null,null,null,null,null,null,null,null,null,null,null,null,null,"Kyaukme",{"$f":"COUNTIF(Data!R:R,W41)","v":0},{"$f":"SUMIF(Data!R:R,W41,Data!DG:DG)","v":0},{"$f":"COUNTIFS(Data!$R:$R,$W41,Data!$EK:$EK,'SHELTER & NFIs'!$Z$13)","v":0},{"$f":"COUNTIFS(Data!$R:$R,$W41,Data!$EK:$EK,'SHELTER & NFIs'!$AA$13)","v":0},{"$f":"COUNTIFS(Data!$R:$R,$W41,Data!$EK:$EK,'SHELTER & NFIs'!$AB$13)","v":0},{"$f":"COUNTIFS(Data!$R:$R,$W41,Data!$EK:$EK,'SHELTER & NFIs'!$AC$13)","v":0}]
[null,null,null,null,null,null,null,null,null,null,null,null,null,null,null,null,null,null,null,null,null,null,"Lashio",{"$f":"COUNTIF(Data!R:R,W42)","v":0},{"$f":"SUMIF(Data!R:R,W42,Data!DG:DG)","v":0},{"$f":"COUNTIFS(Data!$R:$R,$W42,Data!$EK:$EK,'SHELTER & NFIs'!$Z$13)","v":0},{"$f":"COUNTIFS(Data!$R:$R,$W42,Data!$EK:$EK,'SHELTER & NFIs'!$AA$13)","v":0},{"$f":"COUNTIFS(Data!$R:$R,$W42,Data!$EK:$EK,'SHELTER & NFIs'!$AB$13)","v":0},{"$f":"COUNTIFS(Data!$R:$R,$W42,Data!$EK:$EK,'SHELTER & NFIs'!$AC$13)","v":0}]
[null,null,null,null,null,null,null,null,null,null,null,null,null,null,null,null,null,null,null,null,null,null,"Kunlong",{"$f":"COUNTIF(Data!R:R,W43)","v":0},{"$f":"SUMIF(Data!R:R,W43,Data!DG:DG)","v":0},{"$f":"COUNTIFS(Data!$R:$R,$W43,Data!$EK:$EK,'SHELTER & NFIs'!$Z$13)","v":0},{"$f":"COUNTIFS(Data!$R:$R,$W43,Data!$EK:$EK,'SHELTER & NFIs'!$AA$13)","v":0},{"$f":"COUNTIFS(Data!$R:$R,$W43,Data!$EK:$EK,'SHELTER & NFIs'!$AB$13)","v":0},{"$f":"COUNTIFS(Data!$R:$R,$W43,Data!$EK:$EK,'SHELTER & NFIs'!$AC$13)","v":0}]
[null,null,null,null,null,null,null,null,null,null,null,null,null,null,null,null,null,null,null,null,null,null,"Matman",{"$f":"COUNTIF(Data!R:R,W44)","v":0},{"$f":"SUMIF(Data!R:R,W44,Data!DG:DG)","v":0},{"$f":"COUNTIFS(Data!$R:$R,$W44,Data!$EK:$EK,'SHELTER & NFIs'!$Z$13)","v":0},{"$f":"COUNTIFS(Data!$R:$R,$W44,Data!$EK:$EK,'SHELTER & NFIs'!$AA$13)","v":0},{"$f":"COUNTIFS(Data!$R:$R,$W44,Data!$EK:$EK,'SHELTER & NFIs'!$AB$13)","v":0},{"$f":"COUNTIFS(Data!$R:$R,$W44,Data!$EK:$EK,'SHELTER & NFIs'!$AC$13)","v":0}]
[null,null,null,null,null,null,null,null,null,null,null,null,null,null,null,null,null,null,null,null,null,null,"Namtu",{"$f":"COUNTIF(Data!R:R,W45)","v":1},{"$f":"SUMIF(Data!R:R,W45,Data!DG:DG)","v":16},{"$f":"COUNTIFS(Data!$R:$R,$W45,Data!$EK:$EK,'SHELTER & NFIs'!$Z$13)","v":0},{"$f":"COUNTIFS(Data!$R:$R,$W45,Data!$EK:$EK,'SHELTER & NFIs'!$AA$13)","v":0},{"$f":"COUNTIFS(Data!$R:$R,$W45,Data!$EK:$EK,'SHELTER & NFIs'!$AB$13)","v":0},{"$f":"COUNTIFS(Data!$R:$R,$W45,Data!$EK:$EK,'SHELTER & NFIs'!$AC$13)","v":1}]
[null,null,null,null,null,null,null,null,null,null,null,null,null,null,null,null,null,null,null,null,null,null,"Mongmit",{"$f":"COUNTIF(Data!R:R,W46)","v":0},{"$f":"SUMIF(Data!R:R,W46,Data!DG:DG)","v":0},{"$f":"COUNTIFS(Data!$R:$R,$W46,Data!$EK:$EK,'SHELTER & NFIs'!$Z$13)","v":0},{"$f":"COUNTIFS(Data!$R:$R,$W46,Data!$EK:$EK,'SHELTER & NFIs'!$AA$13)","v":0},{"$f":"COUNTIFS(Data!$R:$R,$W46,Data!$EK:$EK,'SHELTER & NFIs'!$AB$13)","v":0},{"$f":"COUNTIFS(Data!$R:$R,$W46,Data!$EK:$EK,'SHELTER & NFIs'!$AC$13)","v":0}]
[null,null,null,null,null,null,null,null,null,null,null,null,null,null,null,null,null,null,null,null,null,null,"Kutkai",{"$f":"COUNTIF(Data!R:R,W47)","v":8},{"$f":"SUMIF(Data!R:R,W47,Data!DG:DG)","v":491},{"$f":"COUNTIFS(Data!$R:$R,$W47,Data!$EK:$EK,'SHELTER & NFIs'!$Z$13)","v":0},{"$f":"COUNTIFS(Data!$R:$R,$W47,Data!$EK:$EK,'SHELTER & NFIs'!$AA$13)","v":0},{"$f":"COUNTIFS(Data!$R:$R,$W47,Data!$EK:$EK,'SHELTER & NFIs'!$AB$13)","v":1},{"$f":"COUNTIFS(Data!$R:$R,$W47,Data!$EK:$EK,'SHELTER & NFIs'!$AC$13)","v":6}]
[null,null,null,null,null,null,null,null,null,null,null,null,null,null,null,null,null,null,null,null,null,null,"Hsipaw",{"$f":"COUNTIF(Data!R:R,W48)","v":0},{"$f":"SUMIF(Data!R:R,W48,Data!DG:DG)","v":0},{"$f":"COUNTIFS(Data!$R:$R,$W48,Data!$EK:$EK,'SHELTER & NFIs'!$Z$13)","v":0},{"$f":"COUNTIFS(Data!$R:$R,$W48,Data!$EK:$EK,'SHELTER & NFIs'!$AA$13)","v":0},{"$f":"COUNTIFS(Data!$R:$R,$W48,Data!$EK:$EK,'SHELTER & NFIs'!$AB$13)","v":0},{"$f":"COUNTIFS(Data!$R:$R,$W48,Data!$EK:$EK,'SHELTER & NFIs'!$AC$13)","v":0}]
[null,null,null,null,null,null,null,null,null,null,null,null,null,null,null,null,null,null,null,null,null,null,"Pangsang",{"$f":"COUNTIF(Data!R:R,W49)","v":0},{"$f":"SUMIF(Data!R:R,W49,Data!DG:DG)","v":0},{"$f":"COUNTIFS(Data!$R:$R,$W49,Data!$EK:$EK,'SHELTER & NFIs'!$Z$13)","v":0},{"$f":"COUNTIFS(Data!$R:$R,$W49,Data!$EK:$EK,'SHELTER & NFIs'!$AA$13)","v":0},{"$f":"COUNTIFS(Data!$R:$R,$W49,Data!$EK:$EK,'SHELTER & NFIs'!$AB$13)","v":0},{"$f":"COUNTIFS(Data!$R:$R,$W49,Data!$EK:$EK,'SHELTER & NFIs'!$AC$13)","v":0}]
[null,null,null,null,null,null,null,null,null,null,null,null,null,null,null,null,null,null,null,null,null,null,"Pangwaun",{"$f":"COUNTIF(Data!R:R,W50)","v":0},{"$f":"SUMIF(Data!R:R,W50,Data!DG:DG)","v":0},{"$f":"COUNTIFS(Data!$R:$R,$W50,Data!$EK:$EK,'SHELTER & NFIs'!$Z$13)","v":0},{"$f":"COUNTIFS(Data!$R:$R,$W50,Data!$EK:$EK,'SHELTER & NFIs'!$AA$13)","v":0},{"$f":"COUNTIFS(Data!$R:$R,$W50,Data!$EK:$EK,'SHELTER & NFIs'!$AB$13)","v":0},{"$f":"COUNTIFS(Data!$R:$R,$W50,Data!$EK:$EK,'SHELTER & NFIs'!$AC$13)","v":0}]
[null,null,null,null,null,null,null,null,null,null,null,null,null,null,null,null,null,null,null,null,null,null,"Hopang",{"$f":"COUNTIF(Data!R:R,W51)","v":0},{"$f":"SUMIF(Data!R:R,W51,Data!DG:DG)","v":0},{"$f":"COUNTIFS(Data!$R:$R,$W51,Data!$EK:$EK,'SHELTER & NFIs'!$Z$13)","v":0},{"$f":"COUNTIFS(Data!$R:$R,$W51,Data!$EK:$EK,'SHELTER & NFIs'!$AA$13)","v":0},{"$f":"COUNTIFS(Data!$R:$R,$W51,Data!$EK:$EK,'SHELTER & NFIs'!$AB$13)","v":0},{"$f":"COUNTIFS(Data!$R:$R,$W51,Data!$EK:$EK,'SHELTER & NFIs'!$AC$13)","v":0}]
[null,null,null,null,null,null,null,null,null,null,null,null,null,null,null,null,null,null,null,null,null,null,"Manton",{"$f":"COUNTIF(Data!R:R,W52)","v":1},{"$f":"SUMIF(Data!R:R,W52,Data!DG:DG)","v":43},{"$f":"COUNTIFS(Data!$R:$R,$W52,Data!$EK:$EK,'SHELTER & NFIs'!$Z$13)","v":0},{"$f":"COUNTIFS(Data!$R:$R,$W52,Data!$EK:$EK,'SHELTER & NFIs'!$AA$13)","v":0},{"$f":"COUNTIFS(Data!$R:$R,$W52,Data!$EK:$EK,'SHELTER & NFIs'!$AB$13)","v":0},{"$f":"COUNTIFS(Data!$R:$R,$W52,Data!$EK:$EK,'SHELTER & NFIs'!$AC$13)","v":1}]
[null,null,null,null,null,null,null,null,null,null,null,null,null,null,null,null,null,null,null,null,null,null,"Konkyan",{"$f":"COUNTIF(Data!R:R,W53)","v":0},{"$f":"SUMIF(Data!R:R,W53,Data!DG:DG)","v":0},{"$f":"COUNTIFS(Data!$R:$R,$W53,Data!$EK:$EK,'SHELTER & NFIs'!$Z$13)","v":0},{"$f":"COUNTIFS(Data!$R:$R,$W53,Data!$EK:$EK,'SHELTER & NFIs'!$AA$13)","v":0},{"$f":"COUNTIFS(Data!$R:$R,$W53,Data!$EK:$EK,'SHELTER & NFIs'!$AB$13)","v":0},{"$f":"COUNTIFS(Data!$R:$R,$W53,Data!$EK:$EK,'SHELTER & NFIs'!$AC$13)","v":0}]
[null,null,null,null,null,null,null,null,null,null,null,null,null,null,null,null,null,null,null,null,null,null,"Tangyan",{"$f":"COUNTIF(Data!R:R,W54)","v":0},{"$f":"SUMIF(Data!R:R,W54,Data!DG:DG)","v":0},{"$f":"COUNTIFS(Data!$R:$R,$W54,Data!$EK:$EK,'SHELTER & NFIs'!$Z$13)","v":0},{"$f":"COUNTIFS(Data!$R:$R,$W54,Data!$EK:$EK,'SHELTER & NFIs'!$AA$13)","v":0},{"$f":"COUNTIFS(Data!$R:$R,$W54,Data!$EK:$EK,'SHELTER & NFIs'!$AB$13)","v":0},{"$f":"COUNTIFS(Data!$R:$R,$W54,Data!$EK:$EK,'SHELTER & NFIs'!$AC$13)","v":0}]
[null,null,null,null,null,null,null,null,null,null,null,null,null,null,null,null,null,null,null,null,null,null,"Namhkan",{"$f":"COUNTIF(Data!R:R,W55)","v":4},{"$f":"SUMIF(Data!R:R,W55,Data!DG:DG)","v":239},{"$f":"COUNTIFS(Data!$R:$R,$W55,Data!$EK:$EK,'SHELTER & NFIs'!$Z$13)","v":0},{"$f":"COUNTIFS(Data!$R:$R,$W55,Data!$EK:$EK,'SHELTER & NFIs'!$AA$13)","v":0},{"$f":"COUNTIFS(Data!$R:$R,$W55,Data!$EK:$EK,'SHELTER & NFIs'!$AB$13)","v":0},{"$f":"COUNTIFS(Data!$R:$R,$W55,Data!$EK:$EK,'SHELTER & NFIs'!$AC$13)","v":4}]
[null,null,null,null,null,null,null,null,null,null,null,null,null,null,null,null,null,null,null,null,null,null,"Mongmao",{"$f":"COUNTIF(Data!R:R,W56)","v":0},{"$f":"SUMIF(Data!R:R,W56,Data!DG:DG)","v":0},{"$f":"COUNTIFS(Data!$R:$R,$W56,Data!$EK:$EK,'SHELTER & NFIs'!$Z$13)","v":0},{"$f":"COUNTIFS(Data!$R:$R,$W56,Data!$EK:$EK,'SHELTER & NFIs'!$AA$13)","v":0},{"$f":"COUNTIFS(Data!$R:$R,$W56,Data!$EK:$EK,'SHELTER & NFIs'!$AB$13)","v":0},{"$f":"COUNTIFS(Data!$R:$R,$W56,Data!$EK:$EK,'SHELTER & NFIs'!$AC$13)","v":0}]
[null,null,null,null,null,null,null,null,null,null,null,null,null,null,null,null,null,null,null,null,null,null,"TOTALS",{"$f":"SUM(X33:X56)","v":16},{"$f":"SUM(Y33:Y56)","v":866},0,0,2,12]
[null,null,null,null,null,null,null,null,null,null,null,null,null,null,null,null,null,null,null,null,null,"OVERALL TOTALS",null,{"$f":"X57+X32","v":126},{"$f":"Y57+Y32","v":14810},0,0,19,102]
[]
[]
[null,null,null,null,null,null,null,null,null,null,null,null,null,null,null,null,null,null,null,null,null,"SHELTER RELATED ISSUES"]
[null,null,null,null,null,null,null,null,null,null,null,null,null,null,null,null,null,null,null,null,null,null,0,"less than 25%","25-50%","51-75%","76-95%","96-100%","blank (no answer)"]
[null,null,null,null,null,null,null,null,null,null,null,null,null,null,null,null,null,null,null,null,null,"Number of camps with approximate proportion of households sharing shelter",{"$f":"COUNTIF(Data!$EL:$EL,W62)","v":26},{"$f":"COUNTIF(Data!$EL:$EL,X62)","v":15},{"$f":"COUNTIF(Data!$EL:$EL,Y62)","v":14},{"$f":"COUNTIF(Data!$EL:$EL,Z62)","v":11},{"$f":"COUNTIF(Data!$EL:$EL,AA62)","v":14},{"$f":"COUNTIF(Data!$EL:$EL,AB62)","v":34},{"$f":"'Analysis Tables'!C39-SUM(W63:AB63)","v":12}]
[null,null,null,null,null,null,null,null,null,null,null,null,null,null,null,null,null,null,null,null,null,"Number of camps with approximate proportion of households without shelter",{"$f":"COUNTIF(Data!$EM:$EM,W62)","v":68},{"$f":"COUNTIF(Data!$EM:$EM,X62)","v":12},{"$f":"COUNTIF(Data!$EM:$EM,Y62)","v":12},{"$f":"COUNTIF(Data!$EM:$EM,Z62)","v":5},{"$f":"COUNTIF(Data!$EM:$EM,AA62)","v":3},{"$f":"COUNTIF(Data!$EM:$EM,AB62)","v":7},{"$f":"'Analysis Tables'!C39-SUM(W64:AB64)","v":19}]
[]
[]
[null,null,null,null,null,null,null,null,null,null,null,null,null,null,null,null,null,null,null,null,null,null,"No","Yes"]
[null,null,null,null,null,null,null,null,null,null,null,null,null,null,null,null,null,null,null,null,null,"Shelters with partitioned rooms for sleeping",{"$f":"COUNTIF(Data!$EN:$EN,\"NO\")","v":28},{"$f":"COUNTIF(Data!$EN:$EN,\"YES\")","v":83}]
[null,null,null,null,null,null,null,null,null,null,null,null,null,null,null,null,null,null,null,null,null,null,{"$f":"W68/SUM(W68:X68)","v":0.25225225225225223},{"$f":"X68/SUM(W68:X68)","v":0.74774774774774777}]

{"sheet":"WASH","index":14,"n_rows":60,"n_cols":34,"rows_kept":60,"cut":false,"hidden":false,"merged":[[54,18,55,18],[54,29,55,29],[6,18,24,18],[25,18,49,18],[50,18,50,19],[6,28,24,28],[25,28,49,28],[50,28,50,29]]}
[]
[]
[]
[]
[null,null,null,null,null,null,null,null,null,null,null,null,null,null,null,null,null,null,null,"SANITATION FACILITIES",null,null,null,null,null,null,null,null,"WATER SOURCES"]
[null,null,null,null,null,null,null,null,null,null,null,null,null,null,null,null,null,null,"State","Townships","Total Number of Sites","Total Number of People","Total No. of functioning toilets","Number of toilets required by Sphere Standard","Separate Toilets for Females","Separate Toilets for Males","Number of Mixed Toilets",null,"State","Townships","Well","Rivers, springs, etc.","Borehole/hand pump","Other"]
[null,null,null,null,null,null,null,null,null,null,null,null,null,null,null,null,null,null,"Kachin","Momauk",{"$f":"COUNTIF(Data!R:R,T7)","v":14},{"$f":"SUMIF(Data!R:R,T7,Data!DH:DH)","v":19493},{"$f":"AA7+Z7+Y7","v":1272},{"$f":"V7/20","v":974.65},{"$f":"SUMIF(Data!R:R,T7,Data!ER:ER)","v":112},{"$f":"SUMIF(Data!R:R,T7,Data!EQ:EQ)","v":100},{"$f":"SUMIF(Data!R:R,T7,Data!ES:ES)","v":1060},null,"Kachin","Momauk",{"$f":"COUNTIFS(Data!R:R,AD7,Data!$EO:$EO,$AE$6)","v":8},{"$f":"COUNTIFS(Data!R:R,AD7,Data!$EO:$EO,$AF$6)","v":4},{"$f":"COUNTIFS(Data!R:R,AD7,Data!$EO:$EO,$AG$6)","v":2},{"$f":"COUNTIFS(Data!R:R,AD7,Data!$EO:$EO,$AH$6)","v":0}]
[null,null,null,null,null,null,null,null,null,null,null,null,null,null,null,null,null,null,null,"Mogaung",{"$f":"COUNTIF(Data!R:R,T8)","v":3},{"$f":"SUMIF(Data!R:R,T8,Data!DH:DH)","v":148},{"$f":"AA8+Z8+Y8","v":17},{"$f":"V8/20","v":7.4},{"$f":"SUMIF(Data!R:R,T8,Data!ER:ER)","v":5},{"$f":"SUMIF(Data!R:R,T8,Data!EQ:EQ)","v":4},{"$f":"SUMIF(Data!R:R,T8,Data!ES:ES)","v":8},null,null,"Mogaung",{"$f":"COUNTIFS(Data!R:R,AD8,Data!$EO:$EO,$AE$6)","v":1},{"$f":"COUNTIFS(Data!R:R,AD8,Data!$EO:$EO,$AF$6)","v":0},{"$f":"COUNTIFS(Data!R:R,AD8,Data!$EO:$EO,$AG$6)","v":2},{"$f":"COUNTIFS(Data!R:R,AD8,Data!$EO:$EO,$AH$6)","v":0}]
[null,null,null,null,null,null,null,null,null,null,null,null,null,null,null,null,null,null,null,"Chipwi",{"$f":"COUNTIF(Data!R:R,T9)","v":3},{"$f":"SUMIF(Data!R:R,T9,Data!DH:DH)","v":1789},102,89.45,{"$f":"SUMIF(Data!R:R,T9,Data!ER:ER)","v":15},{"$f":"SUMIF(Data!R:R,T9,Data!EQ:EQ)","v":15},{"$f":"SUMIF(Data!R:R,T9,Data!ES:ES)","v":72},null,null,"Chipwi",{"$f":"COUNTIFS(Data!R:R,AD9,Data!$EO:$EO,$AE$6)","v":0},{"$f":"COUNTIFS(Data!R:R,AD9,Data!$EO:$EO,$AF$6)","v":3},{"$f":"COUNTIFS(Data!R:R,AD9,Data!$EO:$EO,$AG$6)","v":0},{"$f":"COUNTIFS(Data!R:R,AD9,Data!$EO:$EO,$AH$6)","v":0}]
[null,null,null,null,null,null,null,null,null,null,null,null,null,null,null,null,null,null,null,"Sumprabum",{"$f":"COUNTIF(Data!R:R,T10)","v":0},{"$f":"SUMIF(Data!R:R,T10,Data!DH:DH)","v":0},0,0,{"$f":"SUMIF(Data!R:R,T10,Data!ER:ER)","v":0},{"$f":"SUMIF(Data!R:R,T10,Data!EQ:EQ)","v":0},{"$f":"SUMIF(Data!R:R,T10,Data!ES:ES)","v":0},null,null,"Sumprabum",{"$f":"COUNTIFS(Data!R:R,AD10,Data!$EO:$EO,$AE$6)","v":0},{"$f":"COUNTIFS(Data!R:R,AD10,Data!$EO:$EO,$AF$6)","v":0},{"$f":"COUNTIFS(Data!R:R,AD10,Data!$EO:$EO,$AG$6)","v":0},{"$f":"COUNTIFS(Data!R:R,AD10,Data!$EO:$EO,$AH$6)","v":0}]
[null,null,null,null,null,null,null,null,null,null,null,null,null,null,null,null,null,null,null,"Nawngmun",{"$f":"COUNTIF(Data!R:R,T11)","v":0},{"$f":"SUMIF(Data!R:R,T11,Data!DH:DH)","v":0},0,0,{"$f":"SUMIF(Data!R:R,T11,Data!ER:ER)","v":0},{"$f":"SUMIF(Data!R:R,T11,Data!EQ:EQ)","v":0},{"$f":"SUMIF(Data!R:R,T11,Data!ES:ES)","v":0},null,null,"Nawngmun",{"$f":"COUNTIFS(Data!R:R,AD11,Data!$EO:$EO,$AE$6)","v":0},{"$f":"COUNTIFS(Data!R:R,AD11,Data!$EO:$EO,$AF$6)","v":0},{"$f":"COUNTIFS(Data!R:R,AD11,Data!$EO:$EO,$AG$6)","v":0},{"$f":"COUNTIFS(Data!R:R,AD11,Data!$EO:$EO,$AH$6)","v":0}]
[null,null,null,null,null,null,null,null,null,null,null,null,null,null,null,null,null,null,null,"Mansi",{"$f":"COUNTIF(Data!R:R,T12)","v":9},{"$f":"SUMIF(Data!R:R,T12,Data!DH:DH)","v":6580},265,329,{"$f":"SUMIF(Data!R:R,T12,Data!ER:ER)","v":76},{"$f":"SUMIF(Data!R:R,T12,Data!EQ:EQ)","v":70},{"$f":"SUMIF(Data!R:R,T12,Data!ES:ES)","v":119},null,null,"Mansi",{"$f":"COUNTIFS(Data!R:R,AD12,Data!$EO:$EO,$AE$6)","v":3},{"$f":"COUNTIFS(Data!R:R,AD12,Data!$EO:$EO,$AF$6)","v":4},{"$f":"COUNTIFS(Data!R:R,AD12,Data!$EO:$EO,$AG$6)","v":2},{"$f":"COUNTIFS(Data!R:R,AD12,Data!$EO:$EO,$AH$6)","v":0}]
[null,null,null,null,null,null,null,null,null,null,null,null,null,null,null,null,null,null,null,"Myitkyina",{"$f":"COUNTIF(Data!R:R,T13)","v":25},{"$f":"SUMIF(Data!R:R,T13,Data!DH:DH)","v":6393},166,319.64999999999998,{"$f":"SUMIF(Data!R:R,T13,Data!ER:ER)","v":44},{"$f":"SUMIF(Data!R:R,T13,Data!EQ:EQ)","v":28},{"$f":"SUMIF(Data!R:R,T13,Data!ES:ES)","v":94},null,null,"Myitkyina",{"$f":"COUNTIFS(Data!R:R,AD13,Data!$EO:$EO,$AE$6)","v":14},{"$f":"COUNTIFS(Data!R:R,AD13,Data!$EO:$EO,$AF$6)","v":0},{"$f":"COUNTIFS(Data!R:R,AD13,Data!$EO:$EO,$AG$6)","v":11},{"$f":"COUNTIFS(Data!R:R,AD13,Data!$EO:$EO,$AH$6)","v":0}]
[null,null,null,null,null,null,null,null,null,null,null,null,null,null,null,null,null,null,null,"Khaunglanhpu",{"$f":"COUNTIF(Data!R:R,T14)","v":0},{"$f":"SUMIF(Data!R:R,T14,Data!DH:DH)","v":0},0,0,{"$f":"SUMIF(Data!R:R,T14,Data!ER:ER)","v":0},{"$f":"SUMIF(Data!R:R,T14,Data!EQ:EQ)","v":0},{"$f":"SUMIF(Data!R:R,T14,Data!ES:ES)","v":0},null,null,"Khaunglanhpu",{"$f":"COUNTIFS(Data!R:R,AD14,Data!$EO:$EO,$AE$6)","v":0},{"$f":"COUNTIFS(Data!R:R,AD14,Data!$EO:$EO,$AF$6)","v":0},{"$f":"COUNTIFS(Data!R:R,AD14,Data!$EO:$EO,$AG$6)","v":0},{"$f":"COUNTIFS(Data!R:R,AD14,Data!$EO:$EO,$AH$6)","v":0}]
[null,null,null,null,null,null,null,null,null,null,null,null,null,null,null,null,null,null,null,"Puta-O",{"$f":"COUNTIF(Data!R:R,T15)","v":0},{"$f":"SUMIF(Data!R:R,T15,Data!DH:DH)","v":0},0,0,{"$f":"SUMIF(Data!R:R,T15,Data!ER:ER)","v":0},{"$f":"SUMIF(Data!R:R,T15,Data!EQ:EQ)","v":0},{"$f":"SUMIF(Data!R:R,T15,Data!ES:ES)","v":0},null,null,"Puta-O",{"$f":"COUNTIFS(Data!R:R,AD15,Data!$EO:$EO,$AE$6)","v":0},{"$f":"COUNTIFS(Data!R:R,AD15,Data!$EO:$EO,$AF$6)","v":0},{"$f":"COUNTIFS(Data!R:R,AD15,Data!$EO:$EO,$AG$6)","v":0},{"$f":"COUNTIFS(Data!R:R,AD15,Data!$EO:$EO,$AH$6)","v":0}]
[null,null,null,null,null,null,null,null,null,null,null,null,null,null,null,null,null,null,null,"Shwegu",{"$f":"COUNTIF(Data!R:R,T16)","v":2},{"$f":"SUMIF(Data!R:R,T16,Data!DH:DH)","v":428},12,21.4,{"$f":"SUMIF(Data!R:R,T16,Data!ER:ER)","v":5},{"$f":"SUMIF(Data!R:R,T16,Data!EQ:EQ)","v":3},{"$f":"SUMIF(Data!R:R,T16,Data!ES:ES)","v":4},null,null,"Shwegu",{"$f":"COUNTIFS(Data!R:R,AD16,Data!$EO:$EO,$AE$6)","v":1},{"$f":"COUNTIFS(Data!R:R,AD16,Data!$EO:$EO,$AF$6)","v":0},{"$f":"COUNTIFS(Data!R:R,AD16,Data!$EO:$EO,$AG$6)","v":1},{"$f":"COUNTIFS(Data!R:R,AD16,Data!$EO:$EO,$AH$6)","v":0}]
[null,null,null,null,null,null,null,null,null,null,null,null,null,null,null,null,null,null,null,"Injangyang",{"$f":"COUNTIF(Data!R:R,T17)","v":0},{"$f":"SUMIF(Data!R:R,T17,Data!DH:DH)","v":0},0,0,{"$f":"SUMIF(Data!R:R,T17,Data!ER:ER)","v":0},{"$f":"SUMIF(Data!R:R,T17,Data!EQ:EQ)","v":0},{"$f":"SUMIF(Data!R:R,T17,Data!ES:ES)","v":0},null,null,"Injangyang",{"$f":"COUNTIFS(Data!R:R,AD17,Data!$EO:$EO,$AE$6)","v":0},{"$f":"COUNTIFS(Data!R:R,AD17,Data!$EO:$EO,$AF$6)","v":0},{"$f":"COUNTIFS(Data!R:R,AD17,Data!$EO:$EO,$AG$6)","v":0},{"$f":"COUNTIFS(Data!R:R,AD17,Data!$EO:$EO,$AH$6)","v":0}]
[null,null,null,null,null,null,null,null,null,null,null,null,null,null,null,null,null,null,null,"Tanai",{"$f":"COUNTIF(Data!R:R,T18)","v":0},{"$f":"SUMIF(Data!R:R,T18,Data!DH:DH)","v":0},0,0,{"$f":"SUMIF(Data!R:R,T18,Data!ER:ER)","v":0},{"$f":"SUMIF(Data!R:R,T18,Data!EQ:EQ)","v":0},{"$f":"SUMIF(Data!R:R,T18,Data!ES:ES)","v":0},null,null,"Tanai",{"$f":"COUNTIFS(Data!R:R,AD18,Data!$EO:$EO,$AE$6)","v":0},{"$f":"COUNTIFS(Data!R:R,AD18,Data!$EO:$EO,$AF$6)","v":0},{"$f":"COUNTIFS(Data!R:R,AD18,Data!$EO:$EO,$AG$6)","v":0},{"$f":"COUNTIFS(Data!R:R,AD18,Data!$EO:$EO,$AH$6)","v":0}]
[null,null,null,null,null,null,null,null,null,null,null,null,null,null,null,null,null,null,null,"Bhamo",{"$f":"COUNTIF(Data!R:R,T19)","v":10},{"$f":"SUMIF(Data!R:R,T19,Data!DH:DH)","v":5033},155,251.65,{"$f":"SUMIF(Data!R:R,T19,Data!ER:ER)","v":20},{"$f":"SUMIF(Data!R:R,T19,Data!EQ:EQ)","v":19},{"$f":"SUMIF(Data!R:R,T19,Data!ES:ES)","v":116},null,null,"Bhamo",{"$f":"COUNTIFS(Data!R:R,AD19,Data!$EO:$EO,$AE$6)","v":3},{"$f":"COUNTIFS(Data!R:R,AD19,Data!$EO:$EO,$AF$6)","v":0},{"$f":"COUNTIFS(Data!R:R,AD19,Data!$EO:$EO,$AG$6)","v":7},{"$f":"COUNTIFS(Data!R:R,AD19,Data!$EO:$EO,$AH$6)","v":0}]
[null,null,null,null,null,null,null,null,null,null,null,null,null,null,null,null,null,null,null,"Mohnyin",{"$f":"COUNTIF(Data!R:R,T20)","v":1},{"$f":"SUMIF(Data!R:R,T20,Data!DH:DH)","v":97},3,4.8499999999999996,{"$f":"SUMIF(Data!R:R,T20,Data!ER:ER)","v":0},{"$f":"SUMIF(Data!R:R,T20,Data!EQ:EQ)","v":0},{"$f":"SUMIF(Data!R:R,T20,Data!ES:ES)","v":3},null,null,"Mohnyin",{"$f":"COUNTIFS(Data!R:R,AD20,Data!$EO:$EO,$AE$6)","v":0},{"$f":"COUNTIFS(Data!R:R,AD20,Data!$EO:$EO,$AF$6)","v":0},{"$f":"COUNTIFS(Data!R:R,AD20,Data!$EO:$EO,$AG$6)","v":1},{"$f":"COUNTIFS(Data!R:R,AD20,Data!$EO:$EO,$AH$6)","v":0}]
[null,null,null,null,null,null,null,null,null,null,null,null,null,null,null,null,null,null,null,"Waingmaw",{"$f":"COUNTIF(Data!R:R,T21)","v":21},{"$f":"SUMIF(Data!R:R,T21,Data!DH:DH)","v":20897},735,1044.8499999999999,{"$f":"SUMIF(Data!R:R,T21,Data!ER:ER)","v":32},{"$f":"SUMIF(Data!R:R,T21,Data!EQ:EQ)","v":25},{"$f":"SUMIF(Data!R:R,T21,Data!ES:ES)","v":678},null,null,"Waingmaw",{"$f":"COUNTIFS(Data!R:R,AD21,Data!$EO:$EO,$AE$6)","v":11},{"$f":"COUNTIFS(Data!R:R,AD21,Data!$EO:$EO,$AF$6)","v":7},{"$f":"COUNTIFS(Data!R:R,AD21,Data!$EO:$EO,$AG$6)","v":1},{"$f":"COUNTIFS(Data!R:R,AD21,Data!$EO:$EO,$AH$6)","v":1}]
[null,null,null,null,null,null,null,null,null,null,null,null,null,null,null,null,null,null,null,"Tsawlaw",{"$f":"COUNTIF(Data!R:R,T22)","v":0},{"$f":"SUMIF(Data!R:R,T22,Data!DH:DH)","v":0},0,0,{"$f":"SUMIF(Data!R:R,T22,Data!ER:ER)","v":0},{"$f":"SUMIF(Data!R:R,T22,Data!EQ:EQ)","v":0},{"$f":"SUMIF(Data!R:R,T22,Data!ES:ES)","v":0},null,null,"Tsawlaw",{"$f":"COUNTIFS(Data!R:R,AD22,Data!$EO:$EO,$AE$6)","v":0},{"$f":"COUNTIFS(Data!R:R,AD22,Data!$EO:$EO,$AF$6)","v":0},{"$f":"COUNTIFS(Data!R:R,AD22,Data!$EO:$EO,$AG$6)","v":0},{"$f":"COUNTIFS(Data!R:R,AD22,Data!$EO:$EO,$AH$6)","v":0}]
[null,null,null,null,null,null,null,null,null,null,null,null,null,null,null,null,null,null,null,"Machanbaw",{"$f":"COUNTIF(Data!R:R,T23)","v":0},{"$f":"SUMIF(Data!R:R,T23,Data!DH:DH)","v":0},0,0,{"$f":"SUMIF(Data!R:R,T23,Data!ER:ER)","v":0},{"$f":"SUMIF(Data!R:R,T23,Data!EQ:EQ)","v":0},{"$f":"SUMIF(Data!R:R,T23,Data!ES:ES)","v":0},null,null,"Machanbaw",{"$f":"COUNTIFS(Data!R:R,AD23,Data!$EO:$EO,$AE$6)","v":0},{"$f":"COUNTIFS(Data!R:R,AD23,Data!$EO:$EO,$AF$6)","v":0},{"$f":"COUNTIFS(Data!R:R,AD23,Data!$EO:$EO,$AG$6)","v":0},{"$f":"COUNTIFS(Data!R:R,AD23,Data!$EO:$EO,$AH$6)","v":0}]
[null,null,null,null,null,null,null,null,null,null,null,null,null,null,null,null,null,null,null,"Hpakant",{"$f":"COUNTIF(Data!R:R,T24)","v":22},{"$f":"SUMIF(Data!R:R,T24,Data!DH:DH)","v":3189},116,159.44999999999999,{"$f":"SUMIF(Data!R:R,T24,Data!ER:ER)","v":16},{"$f":"SUMIF(Data!R:R,T24,Data!EQ:EQ)","v":16},{"$f":"SUMIF(Data!R:R,T24,Data!ES:ES)","v":84},null,null,"Hpakant",{"$f":"COUNTIFS(Data!R:R,AD24,Data!$EO:$EO,$AE$6)","v":14},{"$f":"COUNTIFS(Data!R:R,AD24,Data!$EO:$EO,$AF$6)","v":3},{"$f":"COUNTIFS(Data!R:R,AD24,Data!$EO:$EO,$AG$6)","v":1},{"$f":"COUNTIFS(Data!R:R,AD24,Data!$EO:$EO,$AH$6)","v":4}]
[null,null,null,null,null,null,null,null,null,null,null,null,null,null,null,null,null,null,null,"TOTALS",{"$f":"SUM(U7:U24)","v":110},64047,2843,3202.35,325,280,2238,null,null,"TOTALS",{"$f":"SUM(AE7:AE24)","v":55},{"$f":"SUM(AF7:AF24)","v":21},28,5]
[null,null,null,null,null,null,null,null,null,null,null,null,null,null,null,null,null,null,"Shan (North)","Namphan",{"$f":"COUNTIF(Data!R:R,T26)","v":0},{"$f":"SUMIF(Data!R:R,T26,Data!DH:DH)","v":0},0,{"$f":"V26/20","v":0},{"$f":"SUMIF(Data!R:R,T26,Data!ER:ER)","v":0},{"$f":"SUMIF(Data!R:R,T26,Data!EQ:EQ)","v":0},{"$f":"SUMIF(Data!R:R,T26,Data!ES:ES)","v":0},null,"Shan (North)","Namphan",{"$f":"COUNTIFS(Data!R:R,AD26,Data!$EO:$EO,$AE$6)","v":0},{"$f":"COUNTIFS(Data!R:R,AD26,Data!$EO:$EO,$AF$6)","v":0},{"$f":"COUNTIFS(Data!R:R,AD26,Data!$EO:$EO,$AG$6)","v":0},{"$f":"COUNTIFS(Data!R:R,AD26,Data!$EO:$EO,$AH$6)","v":0}]
[null,null,null,null,null,null,null,null,null,null,null,null,null,null,null,null,null,null,null,"Nawnghkio",{"$f":"COUNTIF(Data!R:R,T27)","v":0},{"$f":"SUMIF(Data!R:R,T27,Data!DH:DH)","v":0},0,{"$f":"V27/20","v":0},{"$f":"SUMIF(Data!R:R,T27,Data!ER:ER)","v":0},{"$f":"SUMIF(Data!R:R,T27,Data!EQ:EQ)","v":0},{"$f":"SUMIF(Data!R:R,T27,Data!ES:ES)","v":0},null,null,"Nawnghkio",{"$f":"COUNTIFS(Data!R:R,AD27,Data!$EO:$EO,$AE$6)","v":0},{"$f":"COUNTIFS(Data!R:R,AD27,Data!$EO:$EO,$AF$6)","v":0},{"$f":"COUNTIFS(Data!R:R,AD27,Data!$EO:$EO,$AG$6)","v":0},{"$f":"COUNTIFS(Data!R:R,AD27,Data!$EO:$EO,$AH$6)","v":0}]
[null,null,null,null,null,null,null,null,null,null,null,null,null,null,null,null,null,null,null,"Mongyai",{"$f":"COUNTIF(Data!R:R,T28)","v":0},{"$f":"SUMIF(Data!R:R,T28,Data!DH:DH)","v":0},0,0,{"$f":"SUMIF(Data!R:R,T28,Data!ER:ER)","v":0},{"$f":"SUMIF(Data!R:R,T28,Data!EQ:EQ)","v":0},{"$f":"SUMIF(Data!R:R,T28,Data!ES:ES)","v":0},null,null,"Mongyai",{"$f":"COUNTIFS(Data!R:R,AD28,Data!$EO:$EO,$AE$6)","v":0},{"$f":"COUNTIFS(Data!R:R,AD28,Data!$EO:$EO,$AF$6)","v":0},{"$f":"COUNTIFS(Data!R:R,AD28,Data!$EO:$EO,$AG$6)","v":0},{"$f":"COUNTIFS(Data!R:R,AD28,Data!$EO:$EO,$AH$6)","v":0}]
[null,null,null,null,null,null,null,null,null,null,null,null,null,null,null,null,null,null,null,"Namhsan",{"$f":"COUNTIF(Data!R:R,T29)","v":0},{"$f":"SUMIF(Data!R:R,T29,Data!DH:DH)","v":0},0,0,{"$f":"SUMIF(Data!R:R,T29,Data!ER:ER)","v":0},{"$f":"SUMIF(Data!R:R,T29,Data!EQ:EQ)","v":0},{"$f":"SUMIF(Data!R:R,T29,Data!ES:ES)","v":0},null,null,"Namhsan",{"$f":"COUNTIFS(Data!R:R,AD29,Data!$EO:$EO,$AE$6)","v":0},{"$f":"COUNTIFS(Data!R:R,AD29,Data!$EO:$EO,$AF$6)","v":0},{"$f":"COUNTIFS(Data!R:R,AD29,Data!$EO:$EO,$AG$6)","v":0},{"$f":"COUNTIFS(Data!R:R,AD29,Data!$EO:$EO,$AH$6)","v":0}]
[null,null,null,null,null,null,null,null,null,null,null,null,null,null,null,null,null,null,null,"Hseni",{"$f":"COUNTIF(Data!R:R,T30)","v":1},{"$f":"SUMIF(Data!R:R,T30,Data!DH:DH)","v":258},0,12.9,{"$f":"SUMIF(Data!R:R,T30,Data!ER:ER)","v":0},{"$f":"SUMIF(Data!R:R,T30,Data!EQ:EQ)","v":0},{"$f":"SUMIF(Data!R:R,T30,Data!ES:ES)","v":0},null,null,"Hseni",{"$f":"COUNTIFS(Data!R:R,AD30,Data!$EO:$EO,$AE$6)","v":0},{"$f":"COUNTIFS(Data!R:R,AD30,Data!$EO:$EO,$AF$6)","v":0},{"$f":"COUNTIFS(Data!R:R,AD30,Data!$EO:$EO,$AG$6)","v":0},{"$f":"COUNTIFS(Data!R:R,AD30,Data!$EO:$EO,$AH$6)","v":0}]
[null,null,null,null,null,null,null,null,null,null,null,null,null,null,null,null,null,null,null,"Laukkaing",{"$f":"COUNTIF(Data!R:R,T31)","v":0},{"$f":"SUMIF(Data!R:R,T31,Data!DH:DH)","v":0},0,0,{"$f":"SUMIF(Data!R:R,T31,Data!ER:ER)","v":0},{"$f":"SUMIF(Data!R:R,T31,Data!EQ:EQ)","v":0},{"$f":"SUMIF(Data!R:R,T31,Data!ES:ES)","v":0},null,null,"Laukkaing",{"$f":"COUNTIFS(Data!R:R,AD31,Data!$EO:$EO,$AE$6)","v":0},{"$f":"COUNTIFS(Data!R:R,AD31,Data!$EO:$EO,$AF$6)","v":0},{"$f":"COUNTIFS(Data!R:R,AD31,Data!$EO:$EO,$AG$6)","v":0},{"$f":"COUNTIFS(Data!R:R,AD31,Data!$EO:$EO,$AH$6)","v":0}]
[null,null,null,null,null,null,null,null,null,null,null,null,null,null,null,null,null,null,null,"Muse",{"$f":"COUNTIF(Data!R:R,T32)","v":1},{"$f":"SUMIF(Data!R:R,T32,Data!DH:DH)","v":99},5,4.95,{"$f":"SUMIF(Data!R:R,T32,Data!ER:ER)","v":2},{"$f":"SUMIF(Data!R:R,T32,Data!EQ:EQ)","v":3},{"$f":"SUMIF(Data!R:R,T32,Data!ES:ES)","v":0},null,null,"Muse",{"$f":"COUNTIFS(Data!R:R,AD32,Data!$EO:$EO,$AE$6)","v":0},{"$f":"COUNTIFS(Data!R:R,AD32,Data!$EO:$EO,$AF$6)","v":1},{"$f":"COUNTIFS(Data!R:R,AD32,Data!$EO:$EO,$AG$6)","v":0},{"$f":"COUNTIFS(Data!R:R,AD32,Data!$EO:$EO,$AH$6)","v":0}]
[null,null,null,null,null,null,null,null,null,null,null,null,null,null,null,null,null,null,null,"Mabein",{"$f":"COUNTIF(Data!R:R,T33)","v":0},{"$f":"SUMIF(Data!R:R,T33,Data!DH:DH)","v":0},0,0,{"$f":"SUMIF(Data!R:R,T33,Data!ER:ER)","v":0},{"$f":"SUMIF(Data!R:R,T33,Data!EQ:EQ)","v":0},{"$f":"SUMIF(Data!R:R,T33,Data!ES:ES)","v":0},null,null,"Mabein",{"$f":"COUNTIFS(Data!R:R,AD33,Data!$EO:$EO,$AE$6)","v":0},{"$f":"COUNTIFS(Data!R:R,AD33,Data!$EO:$EO,$AF$6)","v":0},{"$f":"COUNTIFS(Data!R:R,AD33,Data!$EO:$EO,$AG$6)","v":0},{"$f":"COUNTIFS(Data!R:R,AD33,Data!$EO:$EO,$AH$6)","v":0}]
[null,null,null,null,null,null,null,null,null,null,null,null,null,null,null,null,null,null,null,"Kyaukme",{"$f":"COUNTIF(Data!R:R,T34)","v":0},{"$f":"SUMIF(Data!R:R,T34,Data!DH:DH)","v":0},0,0,{"$f":"SUMIF(Data!R:R,T34,Data!ER:ER)","v":0},{"$f":"SUMIF(Data!R:R,T34,Data!EQ:EQ)","v":0},{"$f":"SUMIF(Data!R:R,T34,Data!ES:ES)","v":0},null,null,"Kyaukme",{"$f":"COUNTIFS(Data!R:R,AD34,Data!$EO:$EO,$AE$6)","v":0},{"$f":"COUNTIFS(Data!R:R,AD34,Data!$EO:$EO,$AF$6)","v":0},{"$f":"COUNTIFS(Data!R:R,AD34,Data!$EO:$EO,$AG$6)","v":0},{"$f":"COUNTIFS(Data!R:R,AD34,Data!$EO:$EO,$AH$6)","v":0}]
[null,null,null,null,null,null,null,null,null,null,null,null,null,null,null,null,null,null,null,"Lashio",{"$f":"COUNTIF(Data!R:R,T35)","v":0},{"$f":"SUMIF(Data!R:R,T35,Data!DH:DH)","v":0},0,0,{"$f":"SUMIF(Data!R:R,T35,Data!ER:ER)","v":0},{"$f":"SUMIF(Data!R:R,T35,Data!EQ:EQ)","v":0},{"$f":"SUMIF(Data!R:R,T35,Data!ES:ES)","v":0},null,null,"Lashio",{"$f":"COUNTIFS(Data!R:R,AD35,Data!$EO:$EO,$AE$6)","v":0},{"$f":"COUNTIFS(Data!R:R,AD35,Data!$EO:$EO,$AF$6)","v":0},{"$f":"COUNTIFS(Data!R:R,AD35,Data!$EO:$EO,$AG$6)","v":0},{"$f":"COUNTIFS(Data!R:R,AD35,Data!$EO:$EO,$AH$6)","v":0}]
[null,null,null,null,null,null,null,null,null,null,null,null,null,null,null,null,null,null,null,"Kunlong",{"$f":"COUNTIF(Data!R:R,T36)","v":0},{"$f":"SUMIF(Data!R:R,T36,Data!DH:DH)","v":0},0,0,{"$f":"SUMIF(Data!R:R,T36,Data!ER:ER)","v":0},{"$f":"SUMIF(Data!R:R,T36,Data!EQ:EQ)","v":0},{"$f":"SUMIF(Data!R:R,T36,Data!ES:ES)","v":0},null,null,"Kunlong",{"$f":"COUNTIFS(Data!R:R,AD36,Data!$EO:$EO,$AE$6)","v":0},{"$f":"COUNTIFS(Data!R:R,AD36,Data!$EO:$EO,$AF$6)","v":0},{"$f":"COUNTIFS(Data!R:R,AD36,Data!$EO:$EO,$AG$6)","v":0},{"$f":"COUNTIFS(Data!R:R,AD36,Data!$EO:$EO,$AH$6)","v":0}]
[null,null,null,null,null,null,null,null,null,null,null,null,null,null,null,null,null,null,null,"Matman",{"$f":"COUNTIF(Data!R:R,T37)","v":0},{"$f":"SUMIF(Data!R:R,T37,Data!DH:DH)","v":0},0,0,{"$f":"SUMIF(Data!R:R,T37,Data!ER:ER)","v":0},{"$f":"SUMIF(Data!R:R,T37,Data!EQ:EQ)","v":0},{"$f":"SUMIF(Data!R:R,T37,Data!ES:ES)","v":0},null,null,"Matman",{"$f":"COUNTIFS(Data!R:R,AD37,Data!$EO:$EO,$AE$6)","v":0},{"$f":"COUNTIFS(Data!R:R,AD37,Data!$EO:$EO,$AF$6)","v":0},{"$f":"COUNTIFS(Data!R:R,AD37,Data!$EO:$EO,$AG$6)","v":0},{"$f":"COUNTIFS(Data!R:R,AD37,Data!$EO:$EO,$AH$6)","v":0}]
[null,null,null,null,null,null,null,null,null,null,null,null,null,null,null,null,null,null,null,"Namtu",{"$f":"COUNTIF(Data!R:R,T38)","v":1},{"$f":"SUMIF(Data!R:R,T38,Data!DH:DH)","v":66},4,3.3,{"$f":"SUMIF(Data!R:R,T38,Data!ER:ER)","v":2},{"$f":"SUMIF(Data!R:R,T38,Data!EQ:EQ)","v":2},{"$f":"SUMIF(Data!R:R,T38,Data!ES:ES)","v":0},null,null,"Namtu",{"$f":"COUNTIFS(Data!R:R,AD38,Data!$EO:$EO,$AE$6)","v":0},{"$f":"COUNTIFS(Data!R:R,AD38,Data!$EO:$EO,$AF$6)","v":1},{"$f":"COUNTIFS(Data!R:R,AD38,Data!$EO:$EO,$AG$6)","v":0},{"$f":"COUNTIFS(Data!R:R,AD38,Data!$EO:$EO,$AH$6)","v":0}]
[null,null,null,null,null,null,null,null,null,null,null,null,null,null,null,null,null,null,null,"Mongmit",{"$f":"COUNTIF(Data!R:R,T39)","v":0},{"$f":"SUMIF(Data!R:R,T39,Data!DH:DH)","v":0},0,0,{"$f":"SUMIF(Data!R:R,T39,Data!ER:ER)","v":0},{"$f":"SUMIF(Data!R:R,T39,Data!EQ:EQ)","v":0},{"$f":"SUMIF(Data!R:R,T39,Data!ES:ES)","v":0},null,null,"Mongmit",{"$f":"COUNTIFS(Data!R:R,AD39,Data!$EO:$EO,$AE$6)","v":0},{"$f":"COUNTIFS(Data!R:R,AD39,Data!$EO:$EO,$AF$6)","v":0},{"$f":"COUNTIFS(Data!R:R,AD39,Data!$EO:$EO,$AG$6)","v":0},{"$f":"COUNTIFS(Data!R:R,AD39,Data!$EO:$EO,$AH$6)","v":0}]
[null,null,null,null,null,null,null,null,null,null,null,null,null,null,null,null,null,null,null,"Kutkai",{"$f":"COUNTIF(Data!R:R,T40)","v":8},{"$f":"SUMIF(Data!R:R,T40,Data!DH:DH)","v":2381},136,119.05,{"$f":"SUMIF(Data!R:R,T40,Data!ER:ER)","v":20},{"$f":"SUMIF(Data!R:R,T40,Data!EQ:EQ)","v":19},{"$f":"SUMIF(Data!R:R,T40,Data!ES:ES)","v":97},null,null,"Kutkai",{"$f":"COUNTIFS(Data!R:R,AD40,Data!$EO:$EO,$AE$6)","v":1},{"$f":"COUNTIFS(Data!R:R,AD40,Data!$EO:$EO,$AF$6)","v":6},{"$f":"COUNTIFS(Data!R:R,AD40,Data!$EO:$EO,$AG$6)","v":0},{"$f":"COUNTIFS(Data!R:R,AD40,Data!$EO:$EO,$AH$6)","v":0}]
[null,null,null,null,null,null,null,null,null,null,null,null,null,null,null,null,null,null,null,"Hsipaw",{"$f":"COUNTIF(Data!R:R,T41)","v":0},{"$f":"SUMIF(Data!R:R,T41,Data!DH:DH)","v":0},0,0,{"$f":"SUMIF(Data!R:R,T41,Data!ER:ER)","v":0},{"$f":"SUMIF(Data!R:R,T41,Data!EQ:EQ)","v":0},{"$f":"SUMIF(Data!R:R,T41,Data!ES:ES)","v":0},null,null,"Hsipaw",{"$f":"COUNTIFS(Data!R:R,AD41,Data!$EO:$EO,$AE$6)","v":0},{"$f":"COUNTIFS(Data!R:R,AD41,Data!$EO:$EO,$AF$6)","v":0},{"$f":"COUNTIFS(Data!R:R,AD41,Data!$EO:$EO,$AG$6)","v":0},{"$f":"COUNTIFS(Data!R:R,AD41,Data!$EO:$EO,$AH$6)","v":0}]
[null,null,null,null,null,null,null,null,null,null,null,null,null,null,null,null,null,null,null,"Pangsang",{"$f":"COUNTIF(Data!R:R,T42)","v":0},{"$f":"SUMIF(Data!R:R,T42,Data!DH:DH)","v":0},0,0,{"$f":"SUMIF(Data!R:R,T42,Data!ER:ER)","v":0},{"$f":"SUMIF(Data!R:R,T42,Data!EQ:EQ)","v":0},{"$f":"SUMIF(Data!R:R,T42,Data!ES:ES)","v":0},null,null,"Pangsang",{"$f":"COUNTIFS(Data!R:R,AD42,Data!$EO:$EO,$AE$6)","v":0},{"$f":"COUNTIFS(Data!R:R,AD42,Data!$EO:$EO,$AF$6)","v":0},{"$f":"COUNTIFS(Data!R:R,AD42,Data!$EO:$EO,$AG$6)","v":0},{"$f":"COUNTIFS(Data!R:R,AD42,Data!$EO:$EO,$AH$6)","v":0}]
[null,null,null,null,null,null,null,null,null,null,null,null,null,null,null,null,null,null,null,"Pangwaun",{"$f":"COUNTIF(Data!R:R,T43)","v":0},{"$f":"SUMIF(Data!R:R,T43,Data!DH:DH)","v":0},0,0,{"$f":"SUMIF(Data!R:R,T43,Data!ER:ER)","v":0},{"$f":"SUMIF(Data!R:R,T43,Data!EQ:EQ)","v":0},{"$f":"SUMIF(Data!R:R,T43,Data!ES:ES)","v":0},null,null,"Pangwaun",{"$f":"COUNTIFS(Data!R:R,AD43,Data!$EO:$EO,$AE$6)","v":0},{"$f":"COUNTIFS(Data!R:R,AD43,Data!$EO:$EO,$AF$6)","v":0},{"$f":"COUNTIFS(Data!R:R,AD43,Data!$EO:$EO,$AG$6)","v":0},{"$f":"COUNTIFS(Data!R:R,AD43,Data!$EO:$EO,$AH$6)","v":0}]
[null,null,null,null,null,null,null,null,null,null,null,null,null,null,null,null,null,null,null,"Hopang",{"$f":"COUNTIF(Data!R:R,T44)","v":0},{"$f":"SUMIF(Data!R:R,T44,Data!DH:DH)","v":0},0,0,{"$f":"SUMIF(Data!R:R,T44,Data!ER:ER)","v":0},{"$f":"SUMIF(Data!R:R,T44,Data!EQ:EQ)","v":0},{"$f":"SUMIF(Data!R:R,T44,Data!ES:ES)","v":0},null,null,"Hopang",{"$f":"COUNTIFS(Data!R:R,AD44,Data!$EO:$EO,$AE$6)","v":0},{"$f":"COUNTIFS(Data!R:R,AD44,Data!$EO:$EO,$AF$6)","v":0},{"$f":"COUNTIFS(Data!R:R,AD44,Data!$EO:$EO,$AG$6)","v":0},{"$f":"COUNTIFS(Data!R:R,AD44,Data!$EO:$EO,$AH$6)","v":0}]
[null,null,null,null,null,null,null,null,null,null,null,null,null,null,null,null,null,null,null,"Manton",{"$f":"COUNTIF(Data!R:R,T45)","v":1},{"$f":"SUMIF(Data!R:R,T45,Data!DH:DH)","v":183},0,9.15,{"$f":"SUMIF(Data!R:R,T45,Data!ER:ER)","v":0},{"$f":"SUMIF(Data!R:R,T45,Data!EQ:EQ)","v":0},{"$f":"SUMIF(Data!R:R,T45,Data!ES:ES)","v":0},null,null,"Manton",{"$f":"COUNTIFS(Data!R:R,AD45,Data!$EO:$EO,$AE$6)","v":0},{"$f":"COUNTIFS(Data!R:R,AD45,Data!$EO:$EO,$AF$6)","v":1},{"$f":"COUNTIFS(Data!R:R,AD45,Data!$EO:$EO,$AG$6)","v":0},{"$f":"COUNTIFS(Data!R:R,AD45,Data!$EO:$EO,$AH$6)","v":0}]
[null,null,null,null,null,null,null,null,null,null,null,null,null,null,null,null,null,null,null,"Konkyan",{"$f":"COUNTIF(Data!R:R,T46)","v":0},{"$f":"SUMIF(Data!R:R,T46,Data!DH:DH)","v":0},0,0,{"$f":"SUMIF(Data!R:R,T46,Data!ER:ER)","v":0},{"$f":"SUMIF(Data!R:R,T46,Data!EQ:EQ)","v":0},{"$f":"SUMIF(Data!R:R,T46,Data!ES:ES)","v":0},null,null,"Konkyan",{"$f":"COUNTIFS(Data!R:R,AD46,Data!$EO:$EO,$AE$6)","v":0},{"$f":"COUNTIFS(Data!R:R,AD46,Data!$EO:$EO,$AF$6)","v":0},{"$f":"COUNTIFS(Data!R:R,AD46,Data!$EO:$EO,$AG$6)","v":0},{"$f":"COUNTIFS(Data!R:R,AD46,Data!$EO:$EO,$AH$6)","v":0}]
[null,null,null,null,null,null,null,null,null,null,null,null,null,null,null,null,null,null,null,"Tangyan",{"$f":"COUNTIF(Data!R:R,T47)","v":0},{"$f":"SUMIF(Data!R:R,T47,Data!DH:DH)","v":0},0,0,{"$f":"SUMIF(Data!R:R,T47,Data!ER:ER)","v":0},{"$f":"SUMIF(Data!R:R,T47,Data!EQ:EQ)","v":0},{"$f":"SUMIF(Data!R:R,T47,Data!ES:ES)","v":0},null,null,"Tangyan",{"$f":"COUNTIFS(Data!R:R,AD47,Data!$EO:$EO,$AE$6)","v":0},{"$f":"COUNTIFS(Data!R:R,AD47,Data!$EO:$EO,$AF$6)","v":0},{"$f":"COUNTIFS(Data!R:R,AD47,Data!$EO:$EO,$AG$6)","v":0},{"$f":"COUNTIFS(Data!R:R,AD47,Data!$EO:$EO,$AH$6)","v":0}]
[null,null,null,null,null,null,null,null,null,null,null,null,null,null,null,null,null,null,null,"Namhkan",{"$f":"COUNTIF(Data!R:R,T48)","v":4},{"$f":"SUMIF(Data!R:R,T48,Data!DH:DH)","v":1018},15,50.9,{"$f":"SUMIF(Data!R:R,T48,Data!ER:ER)","v":6},{"$f":"SUMIF(Data!R:R,T48,Data!EQ:EQ)","v":6},{"$f":"SUMIF(Data!R:R,T48,Data!ES:ES)","v":3},null,null,"Namhkan",{"$f":"COUNTIFS(Data!R:R,AD48,Data!$EO:$EO,$AE$6)","v":2},{"$f":"COUNTIFS(Data!R:R,AD48,Data!$EO:$EO,$AF$6)","v":0},{"$f":"COUNTIFS(Data!R:R,AD48,Data!$EO:$EO,$AG$6)","v":1},{"$f":"COUNTIFS(Data!R:R,AD48,Data!$EO:$EO,$AH$6)","v":1}]
[null,null,null,null,null,null,null,null,null,null,null,null,null,null,null,null,null,null,null,"Mongmao",{"$f":"COUNTIF(Data!R:R,T49)","v":0},{"$f":"SUMIF(Data!R:R,T49,Data!DH:DH)","v":0},0,0,{"$f":"SUMIF(Data!R:R,T49,Data!ER:ER)","v":0},{"$f":"SUMIF(Data!R:R,T49,Data!EQ:EQ)","v":0},{"$f":"SUMIF(Data!R:R,T49,Data!ES:ES)","v":0},null,null,"Mongmao",{"$f":"COUNTIFS(Data!R:R,AD49,Data!$EO:$EO,$AE$6)","v":0},{"$f":"COUNTIFS(Data!R:R,AD49,Data!$EO:$EO,$AF$6)","v":0},{"$f":"COUNTIFS(Data!R:R,AD49,Data!$EO:$EO,$AG$6)","v":0},{"$f":"COUNTIFS(Data!R:R,AD49,Data!$EO:$EO,$AH$6)","v":0}]
[null,null,null,null,null,null,null,null,null,null,null,null,null,null,null,null,null,null,null,"TOTALS",{"$f":"SUM(U26:U49)","v":16},4005,160,200.25,30,30,100,null,null,"TOTALS",{"$f":"SUM(AE26:AE49)","v":3},{"$f":"SUM(AF26:AF49)","v":9},1,1]
[null,null,null,null,null,null,null,null,null,null,null,null,null,null,null,null,null,null,"OVERALL TOTALS",null,{"$f":"U50+U25","v":126},68052,3003,3402.6,355,310,2338,null,"OVERALL TOTALS",null,{"$f":"AE50+AE25","v":58},{"$f":"AF50+AF25","v":30},29,6]
[]
[null,null,null,null,null,null,null,null,null,null,null,null,null,null,null,null,null,null,"SEPARATE BATHING FACILITIES",null,null,null,"SOLID WASTE MANAGEMENT",null,null,null,null,null,null,"WATER SUFFICIENT FOR CAMP RESIDENTS"]
[null,null,null,null,null,null,null,null,null,null,null,null,null,null,null,null,null,null,null,"Yes","No",null,null,"Common identified waste dump inside camp","Identified waste dump outside camp","Dumped everywhere inside the camp","Is getting burnt","blank (no answer)",null,null,"Yes","No"]
[null,null,null,null,null,null,null,null,null,null,null,null,null,null,null,null,null,null,"Separate Bathing facilities for men and women",{"$f":"COUNTIF(Data!ET:ET,\"Yes\")","v":49},{"$f":"COUNTIF(Data!ET:ET,\"No\")","v":75},null,"All camp totals",{"$f":"COUNTIF(Data!$EU:$EU,X54)","v":39},{"$f":"COUNTIF(Data!$EU:$EU,Y54)","v":50},{"$f":"COUNTIF(Data!$EU:$EU,Z54)","v":1},{"$f":"COUNTIF(Data!$EU:$EU,AA54)","v":34},{"$f":"U51-SUM(X55:AA55)","v":2},null,"Daily amount of drinking water sufficient for all camp residents",{"$f":"COUNTIF(Data!EP:EP,\"Yes\")","v":91},{"$f":"COUNTIF(Data!EP:EP,\"No\")","v":33}]
[null,null,null,null,null,null,null,null,null,null,null,null,null,null,null,null,null,null,null,{"$f":"T55/SUM(T55:U55)","v":0.39516129032258063},{"$f":"U55/SUM(T55:U55)","v":0.60483870967741937},null,null,null,null,null,null,null,null,null,{"$f":"AE55/SUM(AE55:AF55)","v":0.7338709677419355},{"$f":"AF55/SUM(AE55:AF55)","v":0.2661290322580645}]
[]
[null,null,null,null,null,null,null,null,null,null,null,null,null,null,null,null,null,null,"DISTANCE TO NEAREST WATER SOURCE"]
[null,null,null,null,null,null,null,null,null,null,null,null,null,null,null,null,null,null,"State","less than 0.25 miles","Between 0.25 & 0.5 miles","Between 0.5 & 0.75 miles","Between 0.75 & 1 mile","Between 1 & 5 miles","Greater than  5 miles"]
[null,null,null,null,null,null,null,null,null,null,null,null,null,null,null,null,null,null,"All camps",{"$f":"COUNTIF(Data!$EC:$EC, \"< 0.25\")","v":8},{"$f":"COUNTIFS(Data!$EC:$EC, \"<=0.5\")-T60","v":4},{"$f":"COUNTIFS(Data!$EC:$EC, \"<=0.75\")-U60","v":8},{"$f":"COUNTIFS(Data!$EC:$EC, \"<=1\")-V60","v":5},{"$f":"COUNTIFS(Data!$EC:$EC, \"<=5\")-W60","v":11},{"$f":"COUNTIFS(Data!$EC:$EC, \"> 5\")","v":1}]

{"sheet":"FOOD","index":15,"n_rows":16,"n_cols":26,"rows_kept":16,"cut":false,"hidden":false,"merged":[[14,19,15,19]]}
[]
[]
[]
[]
[null,null,null,null,null,null,null,null,null,null,null,null,null,null,null,null,null,null,null,"DISTANCE TO NEAREST REGULAR MARKET"]
[null,null,null,null,null,null,null,null,null,null,null,null,null,null,null,null,null,null,null,"State","less than 0.25 miles","Between 0.25 & 0.5 miles","Between 0.5 & 0.75 miles","Between 0.75 & 1 mile","Between 1 & 5 miles","Greater than  5 miles"]
[null,null,null,null,null,null,null,null,null,null,null,null,null,null,null,null,null,null,null,"All camps",{"$f":"COUNTIF(Data!$EB:$EB, \"< 0.25\")","v":10},{"$f":"COUNTIFS(Data!$EB:$EB, \"<=0.5\")-U7","v":22},{"$f":"COUNTIFS(Data!$EB:$EB, \"<=0.75\")-V7","v":11},{"$f":"COUNTIFS(Data!$EB:$EB, \"<=1\")-W7","v":34},{"$f":"COUNTIFS(Data!$EB:$EB, \"<=5\")-X7","v":17},{"$f":"COUNTIFS(Data!$EB:$EB, \"> 5\")","v":8}]
[]
[null,null,null,null,null,null,null,null,null,null,null,null,null,null,null,null,null,null,null,"MAIN TYPES OF KITCHEN(S) FOR CAMP RESIDENTS"]
[null,null,null,null,null,null,null,null,null,null,null,null,null,null,null,null,null,null,null,null,"Individual","Communal","Mixed","blank (no answer)"]
[null,null,null,null,null,null,null,null,null,null,null,null,null,null,null,null,null,null,null,"All camp totals",{"$f":"COUNTIF(Data!$EI:$EI,U10)","v":81},{"$f":"COUNTIF(Data!$EI:$EI,V10)","v":31},{"$f":"COUNTIF(Data!$EI:$EI,W10)","v":11},{"$f":"126-SUM(U11:W11)","v":3}]
[]
[null,null,null,null,null,null,null,null,null,null,null,null,null,null,null,null,null,null,null,"STORAGE FACILITIES FOR FOOD"]
[null,null,null,null,null,null,null,null,null,null,null,null,null,null,null,null,null,null,null,null,"Yes","No"]
[null,null,null,null,null,null,null,null,null,null,null,null,null,null,null,null,null,null,null,"Proper storage facility for food in the camp",{"$f":"COUNTIF(Data!EJ:$EJ,\"Yes\")","v":85},{"$f":"COUNTIF(Data!EJ:$EJ,\"No\")","v":39}]
[null,null,null,null,null,null,null,null,null,null,null,null,null,null,null,null,null,null,null,null,{"$f":"U15/SUM(U15:V15)","v":0.68548387096774188},{"$f":"V15/SUM(U15:V15)","v":0.31451612903225806}]

{"sheet":"LIVELIHOOD","index":16,"n_rows":54,"n_cols":25,"rows_kept":54,"cut":false,"hidden":false,"merged":[]}
[]
[]
[]
[]
[null,null,null,null,null,null,null,null,null,null,null,null,null,null,null,null,null,null,null,null,null,"CURRENT MAIN LIVELIHOOD ACTIVITIES FOR MEN"]
[null,null,null,null,null,null,null,null,null,null,null,null,null,null,null,null,null,null,null,null,null,null,"Activity 1","Activity 2","Total"]
[null,null,null,null,null,null,null,null,null,null,null,null,null,null,null,null,null,null,null,null,null,"Farming",{"$f":"COUNTIF(Data!FJ:FJ,V7)","v":35},{"$f":"COUNTIF(Data!FK:FK,V7)","v":0},{"$f":"W7+X7","v":35}]
[null,null,null,null,null,null,null,null,null,null,null,null,null,null,null,null,null,null,null,null,null,"Fishing",{"$f":"COUNTIF(Data!FJ:FJ,V8)","v":1},{"$f":"COUNTIF(Data!FK:FK,V8)","v":1},{"$f":"W8+X8","v":2}]
[null,null,null,null,null,null,null,null,null,null,null,null,null,null,null,null,null,null,null,null,null,"Livestock",{"$f":"COUNTIF(Data!FJ:FJ,V9)","v":9},{"$f":"COUNTIF(Data!FK:FK,V9)","v":3},12]
[null,null,null,null,null,null,null,null,null,null,null,null,null,null,null,null,null,null,null,null,null,"Manufacturing (food processing)",{"$f":"COUNTIF(Data!FJ:FJ,V10)","v":0},{"$f":"COUNTIF(Data!FK:FK,V10)","v":0},0]
[null,null,null,null,null,null,null,null,null,null,null,null,null,null,null,null,null,null,null,null,null,"Mining",{"$f":"COUNTIF(Data!FJ:FJ,V11)","v":26},{"$f":"COUNTIF(Data!FK:FK,V11)","v":5},31]
[null,null,null,null,null,null,null,null,null,null,null,null,null,null,null,null,null,null,null,null,null,"Trade (buying and selling)",{"$f":"COUNTIF(Data!FJ:FJ,V12)","v":8},{"$f":"COUNTIF(Data!FK:FK,V12)","v":4},12]
[null,null,null,null,null,null,null,null,null,null,null,null,null,null,null,null,null,null,null,null,null,"Manufacturing (non-food)",{"$f":"COUNTIF(Data!FJ:FJ,V13)","v":4},{"$f":"COUNTIF(Data!FK:FK,V13)","v":3},7]
[null,null,null,null,null,null,null,null,null,null,null,null,null,null,null,null,null,null,null,null,null,"Handicrafts",{"$f":"COUNTIF(Data!FJ:FJ,V14)","v":4},{"$f":"COUNTIF(Data!FK:FK,V14)","v":4},8]
[null,null,null,null,null,null,null,null,null,null,null,null,null,null,null,null,null,null,null,null,null,"None",{"$f":"COUNTIF(Data!FJ:FJ,V15)","v":11},{"$f":"COUNTIF(Data!FK:FK,V15)","v":55},{"$f":"W15+X15","v":66}]
[]
[]
[null,null,null,null,null,null,null,null,null,null,null,null,null,null,null,null,null,null,null,null,null,"BEFORE DISPLACEMENT, MAIN LIVELIHOOD ACTIVITIES FOR MEN"]
[null,null,null,null,null,null,null,null,null,null,null,null,null,null,null,null,null,null,null,null,null,null,"Activity 1","Activity 2","Total"]
[null,null,null,null,null,null,null,null,null,null,null,null,null,null,null,null,null,null,null,null,null,"Farming",{"$f":"COUNTIF(Data!FL:FL,V20)","v":108},{"$f":"COUNTIF(Data!FM:FM,V20)","v":2},{"$f":"W20+X20","v":110}]
[null,null,null,null,null,null,null,null,null,null,null,null,null,null,null,null,null,null,null,null,null,"Fishing",{"$f":"COUNTIF(Data!FL:FL,V21)","v":0},{"$f":"COUNTIF(Data!FK:FK,V21)","v":1},{"$f":"W21+X21","v":1}]
[null,null,null,null,null,null,null,null,null,null,null,null,null,null,null,null,null,null,null,null,null,"Livestock",{"$f":"COUNTIF(Data!FL:FL,V22)","v":5},{"$f":"COUNTIF(Data!FK:FK,V22)","v":3},8]
[null,null,null,null,null,null,null,null,null,null,null,null,null,null,null,null,null,null,null,null,null,"Manufacturing (food processing)",{"$f":"COUNTIF(Data!FL:FL,V23)","v":0},{"$f":"COUNTIF(Data!FK:FK,V23)","v":0},0]
[null,null,null,null,null,null,null,null,null,null,null,null,null,null,null,null,null,null,null,null,null,"Mining",{"$f":"COUNTIF(Data!FL:FL,V24)","v":2},{"$f":"COUNTIF(Data!FK:FK,V24)","v":5},7]
[null,null,null,null,null,null,null,null,null,null,null,null,null,null,null,null,null,null,null,null,null,"Trade (buying and selling)",{"$f":"COUNTIF(Data!FL:FL,V25)","v":2},{"$f":"COUNTIF(Data!FK:FK,V25)","v":4},6]
[null,null,null,null,null,null,null,null,null,null,null,null,null,null,null,null,null,null,null,null,null,"Manufacturing (non-food)",{"$f":"COUNTIF(Data!FL:FL,V26)","v":1},{"$f":"COUNTIF(Data!FK:FK,V26)","v":3},4]
[null,null,null,null,null,null,null,null,null,null,null,null,null,null,null,null,null,null,null,null,null,"Handicrafts",{"$f":"COUNTIF(Data!FL:FL,V27)","v":0},{"$f":"COUNTIF(Data!FK:FK,V27)","v":4},4]
[null,null,null,null,null,null,null,null,null,null,null,null,null,null,null,null,null,null,null,null,null,"None",{"$f":"COUNTIF(Data!FL:FL,V28)","v":3},{"$f":"COUNTIF(Data!FK:FK,V28)","v":55},{"$f":"W28+X28","v":58}]
[]
[]
[null,null,null,null,null,null,null,null,null,null,null,null,null,null,null,null,null,null,null,null,null,"CURRENT MAIN LIVELIHOOD ACTIVITIES FOR WOMEN"]
[null,null,null,null,null,null,null,null,null,null,null,null,null,null,null,null,null,null,null,null,null,null,"Activity 1","Activity 2","Total"]
[null,null,null,null,null,null,null,null,null,null,null,null,null,null,null,null,null,null,null,null,null,"Farming",{"$f":"COUNTIF(Data!FN:FN,V33)","v":24},{"$f":"COUNTIF(Data!FO:FO,V33)","v":0},{"$f":"W33+X33","v":24}]
[null,null,null,null,null,null,null,null,null,null,null,null,null,null,null,null,null,null,null,null,null,"Fishing",{"$f":"COUNTIF(Data!FN:FN,V34)","v":0},{"$f":"COUNTIF(Data!FO:FO,V34)","v":0},{"$f":"W34+X34","v":0}]
[null,null,null,null,null,null,null,null,null,null,null,null,null,null,null,null,null,null,null,null,null,"Livestock",{"$f":"COUNTIF(Data!FN:FN,V35)","v":20},{"$f":"COUNTIF(Data!FO:FO,V35)","v":10},30]
[null,null,null,null,null,null,null,null,null,null,null,null,null,null,null,null,null,null,null,null,null,"Manufacturing (food processing)",{"$f":"COUNTIF(Data!FN:FN,V36)","v":0},{"$f":"COUNTIF(Data!FO:FO,V36)","v":1},1]
[null,null,null,null,null,null,null,null,null,null,null,null,null,null,null,null,null,null,null,null,null,"Mining",{"$f":"COUNTIF(Data!FN:FN,V37)","v":3},{"$f":"COUNTIF(Data!FO:FO,V37)","v":0},3]
[null,null,null,null,null,null,null,null,null,null,null,null,null,null,null,null,null,null,null,null,null,"Trade (buying and selling)",{"$f":"COUNTIF(Data!FN:FN,V38)","v":17},{"$f":"COUNTIF(Data!FO:FO,V38)","v":3},20]
[null,null,null,null,null,null,null,null,null,null,null,null,null,null,null,null,null,null,null,null,null,"Manufacturing (non-food)",{"$f":"COUNTIF(Data!FN:FN,V39)","v":2},{"$f":"COUNTIF(Data!FO:FO,V39)","v":8},10]
[null,null,null,null,null,null,null,null,null,null,null,null,null,null,null,null,null,null,null,null,null,"Handicrafts",{"$f":"COUNTIF(Data!FN:FN,V40)","v":5},{"$f":"COUNTIF(Data!FO:FO,V40)","v":4},9]
[null,null,null,null,null,null,null,null,null,null,null,null,null,null,null,null,null,null,null,null,null,"None",{"$f":"COUNTIF(Data!FN:FN,V41)","v":22},{"$f":"COUNTIF(Data!FO:FO,V41)","v":68},{"$f":"W41+X41","v":90}]
[]
[]
[null,null,null,null,null,null,null,null,null,null,null,null,null,null,null,null,null,null,null,null,null,"BEFORE DISPLACEMENT, MAIN LIVELIHOOD ACTIVITIES FOR WOMEN"]
[null,null,null,null,null,null,null,null,null,null,null,null,null,null,null,null,null,null,null,null,null,null,"Activity 1","Activity 2","Total"]
[null,null,null,null,null,null,null,null,null,null,null,null,null,null,null,null,null,null,null,null,null,"Farming",{"$f":"COUNTIF(Data!FP:FP,V46)","v":102},{"$f":"COUNTIF(Data!FQ:FQ,V46)","v":3},{"$f":"W46+X46","v":105}]
[null,null,null,null,null,null,null,null,null,null,null,null,null,null,null,null,null,null,null,null,null,"Fishing",{"$f":"COUNTIF(Data!FP:FP,V47)","v":0},{"$f":"COUNTIF(Data!FQ:FQ,V47)","v":0},{"$f":"W47+X47","v":0}]
[null,null,null,null,null,null,null,null,null,null,null,null,null,null,null,null,null,null,null,null,null,"Livestock",{"$f":"COUNTIF(Data!FP:FP,V48)","v":8},{"$f":"COUNTIF(Data!FQ:FQ,V48)","v":67},75]
[null,null,null,null,null,null,null,null,null,null,null,null,null,null,null,null,null,null,null,null,null,"Manufacturing (food processing)",{"$f":"COUNTIF(Data!FP:FP,V49)","v":1},{"$f":"COUNTIF(Data!FQ:FQ,V49)","v":0},1]
[null,null,null,null,null,null,null,null,null,null,null,null,null,null,null,null,null,null,null,null,null,"Mining",{"$f":"COUNTIF(Data!FP:FP,V50)","v":0},{"$f":"COUNTIF(Data!FQ:FQ,V50)","v":1},1]
[null,null,null,null,null,null,null,null,null,null,null,null,null,null,null,null,null,null,null,null,null,"Trade (buying and selling)",{"$f":"COUNTIF(Data!FP:FP,V51)","v":5},{"$f":"COUNTIF(Data!FQ:FQ,V51)","v":19},24]
[null,null,null,null,null,null,null,null,null,null,null,null,null,null,null,null,null,null,null,null,null,"Manufacturing (non-food)",{"$f":"COUNTIF(Data!FP:FP,V52)","v":0},{"$f":"COUNTIF(Data!FQ:FQ,V52)","v":2},2]
[null,null,null,null,null,null,null,null,null,null,null,null,null,null,null,null,null,null,null,null,null,"Handicrafts",{"$f":"COUNTIF(Data!FP:FP,V53)","v":1},{"$f":"COUNTIF(Data!FQ:FQ,V53)","v":0},1]
[null,null,null,null,null,null,null,null,null,null,null,null,null,null,null,null,null,null,null,null,null,"None",{"$f":"COUNTIF(Data!FP:FP,V54)","v":3},{"$f":"COUNTIF(Data!FQ:FQ,V54)","v":4},{"$f":"W54+X54","v":7}]

{"sheet":"EDUCATION","index":17,"n_rows":24,"n_cols":24,"rows_kept":24,"cut":false,"hidden":false,"merged":[]}
[]
[]
[]
[]
[null,null,null,null,null,null,null,null,null,null,null,null,null,null,null,null,"NEAREST PRESCHOOL/NURSERY"]
[null,null,null,null,null,null,null,null,null,null,null,null,null,null,null,null,"State","less than 0.25 miles","Between 0.25 & 0.5 miles","Between 0.5 & 0.75 miles","Between 0.75 & 1 mile","Between 1 & 5 miles","Greater than  5 miles"]
[null,null,null,null,null,null,null,null,null,null,null,null,null,null,null,null,"All camps",{"$f":"COUNTIF(Data!$EE:EE, \"< 0.25\")","v":14},{"$f":"COUNTIFS(Data!$EE:EE, \"<=0.5\")-R7","v":8},{"$f":"COUNTIFS(Data!$EE:EE, \"<=0.75\")-S7","v":15},{"$f":"COUNTIFS(Data!$EE:EE, \"<=1\")-T7","v":8},{"$f":"COUNTIFS(Data!$EE:EE, \"<=5\")-U7","v":15},{"$f":"COUNTIFS(Data!$EE:EE, \"> 5\")","v":1}]
[]
[null,null,null,null,null,null,null,null,null,null,null,null,null,null,null,null,"NEAREST PRIMARY SCHOOL"]
[null,null,null,null,null,null,null,null,null,null,null,null,null,null,null,null,"State","less than 0.25 miles","Between 0.25 & 0.5 miles","Between 0.5 & 0.75 miles","Between 0.75 & 1 mile","Between 1 & 5 miles","Greater than  5 miles"]
[null,null,null,null,null,null,null,null,null,null,null,null,null,null,null,null,"All camps",{"$f":"COUNTIF(Data!$EF:EF, \"< 0.25\")","v":16},{"$f":"COUNTIFS(Data!$EF:EF, \"<=0.5\")-R11","v":14},{"$f":"COUNTIFS(Data!$EF:EF, \"<=0.75\")-S11","v":17},{"$f":"COUNTIFS(Data!$EF:EF, \"<=1\")-T11","v":22},{"$f":"COUNTIFS(Data!$EF:EF, \"<=5\")-U11","v":19},{"$f":"COUNTIFS(Data!$EF:EF, \"> 5\")","v":1}]
[]
[null,null,null,null,null,null,null,null,null,null,null,null,null,null,null,null,"NEAREST MIDDLE SCHOOL"]
[null,null,null,null,null,null,null,null,null,null,null,null,null,null,null,null,"State","less than 0.25 miles","Between 0.25 & 0.5 miles","Between 0.5 & 0.75 miles","Between 0.75 & 1 mile","Between 1 & 5 miles","Greater than  5 miles"]
[null,null,null,null,null,null,null,null,null,null,null,null,null,null,null,null,"All camps",{"$f":"COUNTIF(Data!$EG:EG, \"< 0.25\")","v":12},{"$f":"COUNTIFS(Data!$EG:EG, \"<=0.5\")-R15","v":16},{"$f":"COUNTIFS(Data!$EG:EG, \"<=0.75\")-S15","v":12},{"$f":"COUNTIFS(Data!$EG:EG, \"<=1\")-T15","v":25},{"$f":"COUNTIFS(Data!$EG:EG, \"<=5\")-U15","v":21},{"$f":"COUNTIFS(Data!$EG:EG, \"> 5\")","v":1}]
[]
[null,null,null,null,null,null,null,null,null,null,null,null,null,null,null,null,"NEAREST HIGH SCHOOL"]
[null,null,null,null,null,null,null,null,null,null,null,null,null,null,null,null,"State","less than 0.25 miles","Between 0.25 & 0.5 miles","Between 0.5 & 0.75 miles","Between 0.75 & 1 mile","Between 1 & 5 miles","Greater than  5 miles"]
[null,null,null,null,null,null,null,null,null,null,null,null,null,null,null,null,"All camps",{"$f":"COUNTIF(Data!$EH:EH, \"< 0.25\")","v":8},{"$f":"COUNTIFS(Data!$EH:EH, \"<=0.5\")-R19","v":13},{"$f":"COUNTIFS(Data!$EH:EH, \"<=0.75\")-S19","v":9},{"$f":"COUNTIFS(Data!$EH:EH, \"<=1\")-T19","v":24},{"$f":"COUNTIFS(Data!$EH:EH, \"<=5\")-U19","v":22},{"$f":"COUNTIFS(Data!$EH:EH, \"> 5\")","v":10}]
[]
[]
[null,null,null,null,null,null,null,null,null,null,null,null,null,null,null,null,null,0,"less than 25%","25-50%","51-75%","76-95%","96-100%","blank (no answer)"]
[null,null,null,null,null,null,null,null,null,null,null,null,null,null,null,null,"Approximate proportion of FEMALE children attending school",{"$f":"COUNTIF(Data!$FH:FH,R22)","v":7},{"$f":"COUNTIF(Data!$FH:FH,S22)","v":10},{"$f":"COUNTIF(Data!$FH:FH,T22)","v":8},{"$f":"COUNTIF(Data!$FH:FH,U22)","v":19},{"$f":"COUNTIF(Data!$FH:FH,V22)","v":22},{"$f":"COUNTIF(Data!$FH:FH,W22)","v":58},{"$f":"'Analysis Tables'!C39-SUM(R23:W23)","v":2}]
[null,null,null,null,null,null,null,null,null,null,null,null,null,null,null,null,"Approximate proportion of MALE children attending school",{"$f":"COUNTIF(Data!$FI:FI,R22)","v":3},{"$f":"COUNTIF(Data!$FI:FI,S22)","v":14},{"$f":"COUNTIF(Data!$FI:FI,T22)","v":14},{"$f":"COUNTIF(Data!$FI:FI,U22)","v":10},{"$f":"COUNTIF(Data!$FI:FI,V22)","v":26},{"$f":"COUNTIF(Data!$FI:FI,W22)","v":57},{"$f":"'Analysis Tables'!C39-SUM(R24:W24)","v":2}]

{"sheet":"PROTECTION","index":18,"n_rows":53,"n_cols":40,"rows_kept":53,"cut":false,"hidden":false,"merged":[[7,20,25,20],[26,20,50,20],[51,20,51,21]]}
[]
[]
[]
[]
[]
[null,null,null,null,null,null,null,null,null,null,null,null,null,null,null,null,null,null,null,null,"VULNERABLE POPULATIONS IN CAMPS"]
[null,null,null,null,null,null,null,null,null,null,null,null,null,null,null,null,null,null,null,null,"State","Townships","Physically Disabled - Males","Mentally Disabled - Males","Chronically ill - Males","Unaccompanied children (<18) - Males","Separated children (<18) - Males","Unaccompanied elders (>60) - Males","Single headed households - Males","Male Totals","Physically Disabled - Females","Mentally Disabled - Females","Chronically ill - Females","Unaccompanied children (<18) - Females","Separated children (<18) - Females","Unaccompanied elders (>60) - Females","Single headed households - Females","Pregnant women","Lactating women","Female Totals"]
[null,null,null,null,null,null,null,null,null,null,null,null,null,null,null,null,null,null,null,null,"Kachin","Momauk",76,2,42,20,516,34,11,701,36,3,53,19,590,49,609,216,343,1918]
[null,null,null,null,null,null,null,null,null,null,null,null,null,null,null,null,null,null,null,null,null,"Mogaung",2,0,0,3,1,0,1,7,0,0,1,0,0,1,7,3,10,22]
[null,null,null,null,null,null,null,null,null,null,null,null,null,null,null,null,null,null,null,null,null,"Chipwi",8,1,6,0,2,0,0,17,3,2,11,0,3,6,20,15,87,147]
[null,null,null,null,null,null,null,null,null,null,null,null,null,null,null,null,null,null,null,null,null,"Sumprabum",0,0,0,0,0,0,0,0,0,0,0,0,0,0,0,0,0,0]
[null,null,null,null,null,null,null,null,null,null,null,null,null,null,null,null,null,null,null,null,null,"Nawngmun",0,0,0,0,0,0,0,0,0,0,0,0,0,0,0,0,0,0]
[null,null,null,null,null,null,null,null,null,null,null,null,null,null,null,null,null,null,null,null,null,"Mansi",44,92,27,4,76,15,132,390,39,55,28,9,90,27,189,72,300,809]
[null,null,null,null,null,null,null,null,null,null,null,null,null,null,null,null,null,null,null,null,null,"Myitkyina",26,11,24,50,9,16,11,147,15,5,23,49,10,36,76,66,130,410]
[null,null,null,null,null,null,null,null,null,null,null,null,null,null,null,null,null,null,null,null,null,"Khaunglanhpu",0,0,0,0,0,0,0,0,0,0,0,0,0,0,0,0,0,0]
[null,null,null,null,null,null,null,null,null,null,null,null,null,null,null,null,null,null,null,null,null,"Puta-O",0,0,0,0,0,0,0,0,0,0,0,0,0,0,0,0,0,0]
[null,null,null,null,null,null,null,null,null,null,null,null,null,null,null,null,null,null,null,null,null,"Shwegu",2,0,1,49,1,0,1,54,3,0,1,61,0,0,6,6,17,94]
[null,null,null,null,null,null,null,null,null,null,null,null,null,null,null,null,null,null,null,null,null,"Injangyang",0,0,0,0,0,0,0,0,0,0,0,0,0,0,0,0,0,0]
[null,null,null,null,null,null,null,null,null,null,null,null,null,null,null,null,null,null,null,null,null,"Tanai",0,0,0,0,0,0,0,0,0,0,0,0,0,0,0,0,0,0]
[null,null,null,null,null,null,null,null,null,null,null,null,null,null,null,null,null,null,null,null,null,"Bhamo",9,4,5,23,30,4,6,81,10,3,9,21,27,10,30,22,178,310]
[null,null,null,null,null,null,null,null,null,null,null,null,null,null,null,null,null,null,null,null,null,"Mohnyin",1,0,0,2,0,1,0,4,1,0,1,1,1,1,3,2,1,11]
[null,null,null,null,null,null,null,null,null,null,null,null,null,null,null,null,null,null,null,null,null,"Waingmaw",109,15,127,46,39,13,59,408,68,9,139,59,30,32,240,227,465,1269]
[null,null,null,null,null,null,null,null,null,null,null,null,null,null,null,null,null,null,null,null,null,"Tsawlaw",0,0,0,0,0,0,0,0,0,0,0,0,0,0,0,0,0,0]
[null,null,null,null,null,null,null,null,null,null,null,null,null,null,null,null,null,null,null,null,null,"Machanbaw",0,0,0,0,0,0,0,0,0,0,0,0,0,0,0,0,0,0]
[null,null,null,null,null,null,null,null,null,null,null,null,null,null,null,null,null,null,null,null,null,"Hpakant",13,5,19,6,7,1,13,64,12,4,12,2,2,4,54,26,110,226]
[null,null,null,null,null,null,null,null,null,null,null,null,null,null,null,null,null,null,null,null,null,"TOTALS",290,130,251,203,681,84,234,1873,187,81,278,221,753,166,1234,655,1641,5216]
[null,null,null,null,null,null,null,null,null,null,null,null,null,null,null,null,null,null,null,null,"Shan (North)","Namphan",0,0,0,0,0,0,0,0,0,0,0,0,0,0,0,0,0,0]
[null,null,null,null,null,null,null,null,null,null,null,null,null,null,null,null,null,null,null,null,null,"Nawnghkio",0,0,0,0,0,0,0,0,0,0,0,0,0,0,0,0,0,0]
[null,null,null,null,null,null,null,null,null,null,null,null,null,null,null,null,null,null,null,null,null,"Mongyai",0,0,0,0,0,0,0,0,0,0,0,0,0,0,0,0,0,0]
[null,null,null,null,null,null,null,null,null,null,null,null,null,null,null,null,null,null,null,null,null,"Namhsan",0,0,0,0,0,0,0,0,0,0,0,0,0,0,0,0,0,0]
[null,null,null,null,null,null,null,null,null,null,null,null,null,null,null,null,null,null,null,null,null,"Hseni",0,0,0,0,0,1,0,1,0,0,2,0,0,1,0,3,6,12]
[null,null,null,null,null,null,null,null,null,null,null,null,null,null,null,null,null,null,null,null,null,"Laukkaing",0,0,0,0,0,0,0,0,0,0,0,0,0,0,0,0,0,0]
[null,null,null,null,null,null,null,null,null,null,null,null,null,null,null,null,null,null,null,null,null,"Muse",0,1,1,0,0,0,0,2,1,0,2,0,0,0,6,2,3,14]
[null,null,null,null,null,null,null,null,null,null,null,null,null,null,null,null,null,null,null,null,null,"Mabein",0,0,0,0,0,0,0,0,0,0,0,0,0,0,0,0,0,0]
[null,null,null,null,null,null,null,null,null,null,null,null,null,null,null,null,null,null,null,null,null,"Kyaukme",0,0,0,0,0,0,0,0,0,0,0,0,0,0,0,0,0,0]
[null,null,null,null,null,null,null,null,null,null,null,null,null,null,null,null,null,null,null,null,null,"Lashio",0,0,0,0,0,0,0,0,0,0,0,0,0,0,0,0,0,0]
[null,null,null,null,null,null,null,null,null,null,null,null,null,null,null,null,null,null,null,null,null,"Kunlong",0,0,0,0,0,0,0,0,0,0,0,0,0,0,0,0,0,0]
[null,null,null,null,null,null,null,null,null,null,null,null,null,null,null,null,null,null,null,null,null,"Matman",0,0,0,0,0,0,0,0,0,0,0,0,0,0,0,0,0,0]
[null,null,null,null,null,null,null,null,null,null,null,null,null,null,null,null,null,null,null,null,null,"Namtu",0,0,0,0,0,0,0,0,1,0,0,0,0,0,0,0,8,9]
[null,null,null,null,null,null,null,null,null,null,null,null,null,null,null,null,null,null,null,null,null,"Mongmit",0,0,0,0,0,0,0,0,0,0,0,0,0,0,0,0,0,0]
[null,null,null,null,null,null,null,null,null,null,null,null,null,null,null,null,null,null,null,null,null,"Kutkai",8,0,12,20,4,9,5,58,5,2,10,34,5,20,16,36,84,212]
[null,null,null,null,null,null,null,null,null,null,null,null,null,null,null,null,null,null,null,null,null,"Hsipaw",0,0,0,0,0,0,0,0,0,0,0,0,0,0,0,0,0,0]
[null,null,null,null,null,null,null,null,null,null,null,null,null,null,null,null,null,null,null,null,null,"Pangsang",0,0,0,0,0,0,0,0,0,0,0,0,0,0,0,0,0,0]
[null,null,null,null,null,null,null,null,null,null,null,null,null,null,null,null,null,null,null,null,null,"Pangwaun",0,0,0,0,0,0,0,0,0,0,0,0,0,0,0,0,0,0]
[null,null,null,null,null,null,null,null,null,null,null,null,null,null,null,null,null,null,null,null,null,"Hopang",0,0,0,0,0,0,0,0,0,0,0,0,0,0,0,0,0,0]
[null,null,null,null,null,null,null,null,null,null,null,null,null,null,null,null,null,null,null,null,null,"Manton",0,1,0,0,1,0,1,3,2,0,1,0,2,0,2,2,5,14]
[null,null,null,null,null,null,null,null,null,null,null,null,null,null,null,null,null,null,null,null,null,"Konkyan",0,0,0,0,0,0,0,0,0,0,0,0,0,0,0,0,0,0]
[null,null,null,null,null,null,null,null,null,null,null,null,null,null,null,null,null,null,null,null,null,"Tangyan",0,0,0,0,0,0,0,0,0,0,0,0,0,0,0,0,0,0]
[null,null,null,null,null,null,null,null,null,null,null,null,null,null,null,null,null,null,null,null,null,"Namhkan",4,0,5,3,5,1,4,22,3,1,4,4,4,5,16,11,32,80]
[null,null,null,null,null,null,null,null,null,null,null,null,null,null,null,null,null,null,null,null,null,"Mongmao",0,0,0,0,0,0,0,0,0,0,0,0,0,0,0,0,0,0]
[null,null,null,null,null,null,null,null,null,null,null,null,null,null,null,null,null,null,null,null,null,"TOTALS",12,2,18,23,10,11,10,86,12,3,19,38,11,26,40,54,138,341]
[null,null,null,null,null,null,null,null,null,null,null,null,null,null,null,null,null,null,null,null,"OVERALL TOTALS",null,302,132,269,226,691,95,244,1959,199,84,297,259,764,192,1274,709,1779,5557]
[null,null,null,null,null,null,null,null,null,null,null,null,null,null,null,null,null,null,null,null,null,null,-302,-132,-269,-226,-691,-95,-244]

{"sheet":"MOVEMENT","index":19,"n_rows":50,"n_cols":26,"rows_kept":50,"cut":false,"hidden":false,"merged":[[5,21,23,21],[24,21,48,21],[49,21,49,22]]}
[]
[]
[]
[]
[null,null,null,null,null,null,null,null,null,null,null,null,null,null,null,null,null,null,null,null,null,"State","Townships","Total Number of Sites","Permanent arrivals in last 6 months - Households","Permanent departures in last 6 months - Households"]
[null,null,null,null,null,null,null,null,null,null,null,null,null,null,null,null,null,null,null,null,null,"Kachin","Momauk",{"$f":"COUNTIF(Data!R:R,W6)","v":14},{"$f":"SUMIFS(Data!DI:DI,Data!R:R,MOVEMENT!W6)","v":68},{"$f":"SUMIFS(Data!DK:DK,Data!R:R,MOVEMENT!W6)","v":38}]
[null,null,null,null,null,null,null,null,null,null,null,null,null,null,null,null,null,null,null,null,null,null,"Mogaung",{"$f":"COUNTIF(Data!R:R,W7)","v":3},{"$f":"SUMIFS(Data!DI:DI,Data!R:R,MOVEMENT!W7)","v":2},{"$f":"SUMIFS(Data!DK:DK,Data!R:R,MOVEMENT!W7)","v":7}]
[null,null,null,null,null,null,null,null,null,null,null,null,null,null,null,null,null,null,null,null,null,null,"Chipwi",{"$f":"COUNTIF(Data!R:R,W8)","v":3},{"$f":"SUMIFS(Data!DI:DI,Data!R:R,MOVEMENT!W8)","v":245},{"$f":"SUMIFS(Data!DK:DK,Data!R:R,MOVEMENT!W8)","v":3}]
[null,null,null,null,null,null,null,null,null,null,null,null,null,null,null,null,null,null,null,null,null,null,"Sumprabum",{"$f":"COUNTIF(Data!R:R,W9)","v":0},{"$f":"SUMIFS(Data!DI:DI,Data!R:R,MOVEMENT!W9)","v":0},{"$f":"SUMIFS(Data!DK:DK,Data!R:R,MOVEMENT!W9)","v":0}]
[null,null,null,null,null,null,null,null,null,null,null,null,null,null,null,null,null,null,null,null,null,null,"Nawngmun",{"$f":"COUNTIF(Data!R:R,W10)","v":0},{"$f":"SUMIFS(Data!DI:DI,Data!R:R,MOVEMENT!W10)","v":0},{"$f":"SUMIFS(Data!DK:DK,Data!R:R,MOVEMENT!W10)","v":0}]
[null,null,null,null,null,null,null,null,null,null,null,null,null,null,null,null,null,null,null,null,null,null,"Mansi",{"$f":"COUNTIF(Data!R:R,W11)","v":9},{"$f":"SUMIFS(Data!DI:DI,Data!R:R,MOVEMENT!W11)","v":169},{"$f":"SUMIFS(Data!DK:DK,Data!R:R,MOVEMENT!W11)","v":49}]
[null,null,null,null,null,null,null,null,null,null,null,null,null,null,null,null,null,null,null,null,null,null,"Myitkyina",{"$f":"COUNTIF(Data!R:R,W12)","v":25},{"$f":"SUMIFS(Data!DI:DI,Data!R:R,MOVEMENT!W12)","v":188},{"$f":"SUMIFS(Data!DK:DK,Data!R:R,MOVEMENT!W12)","v":75}]
[null,null,null,null,null,null,null,null,null,null,null,null,null,null,null,null,null,null,null,null,null,null,"Khaunglanhpu",{"$f":"COUNTIF(Data!R:R,W13)","v":0},{"$f":"SUMIFS(Data!DI:DI,Data!R:R,MOVEMENT!W13)","v":0},{"$f":"SUMIFS(Data!DK:DK,Data!R:R,MOVEMENT!W13)","v":0}]
[null,null,null,null,null,null,null,null,null,null,null,null,null,null,null,null,null,null,null,null,null,null,"Puta-O",{"$f":"COUNTIF(Data!R:R,W14)","v":0},{"$f":"SUMIFS(Data!DI:DI,Data!R:R,MOVEMENT!W14)","v":0},{"$f":"SUMIFS(Data!DK:DK,Data!R:R,MOVEMENT!W14)","v":0}]
[null,null,null,null,null,null,null,null,null,null,null,null,null,null,null,null,null,null,null,null,null,null,"Shwegu",{"$f":"COUNTIF(Data!R:R,W15)","v":2},{"$f":"SUMIFS(Data!DI:DI,Data!R:R,MOVEMENT!W15)","v":0},{"$f":"SUMIFS(Data!DK:DK,Data!R:R,MOVEMENT!W15)","v":2}]
[null,null,null,null,null,null,null,null,null,null,null,null,null,null,null,null,null,null,null,null,null,null,"Injangyang",{"$f":"COUNTIF(Data!R:R,W16)","v":0},{"$f":"SUMIFS(Data!DI:DI,Data!R:R,MOVEMENT!W16)","v":0},{"$f":"SUMIFS(Data!DK:DK,Data!R:R,MOVEMENT!W16)","v":0}]
[null,null,null,null,null,null,null,null,null,null,null,null,null,null,null,null,null,null,null,null,null,null,"Tanai",{"$f":"COUNTIF(Data!R:R,W17)","v":0},{"$f":"SUMIFS(Data!DI:DI,Data!R:R,MOVEMENT!W17)","v":0},{"$f":"SUMIFS(Data!DK:DK,Data!R:R,MOVEMENT!W17)","v":0}]
[null,null,null,null,null,null,null,null,null,null,null,null,null,null,null,null,null,null,null,null,null,null,"Bhamo",{"$f":"COUNTIF(Data!R:R,W18)","v":10},{"$f":"SUMIFS(Data!DI:DI,Data!R:R,MOVEMENT!W18)","v":186},{"$f":"SUMIFS(Data!DK:DK,Data!R:R,MOVEMENT!W18)","v":82}]
[null,null,null,null,null,null,null,null,null,null,null,null,null,null,null,null,null,null,null,null,null,null,"Mohnyin",{"$f":"COUNTIF(Data!R:R,W19)","v":1},{"$f":"SUMIFS(Data!DI:DI,Data!R:R,MOVEMENT!W19)","v":21},{"$f":"SUMIFS(Data!DK:DK,Data!R:R,MOVEMENT!W19)","v":2}]
[null,null,null,null,null,null,null,null,null,null,null,null,null,null,null,null,null,null,null,null,null,null,"Waingmaw",{"$f":"COUNTIF(Data!R:R,W20)","v":21},{"$f":"SUMIFS(Data!DI:DI,Data!R:R,MOVEMENT!W20)","v":164},{"$f":"SUMIFS(Data!DK:DK,Data!R:R,MOVEMENT!W20)","v":107}]
[null,null,null,null,null,null,null,null,null,null,null,null,null,null,null,null,null,null,null,null,null,null,"Tsawlaw",{"$f":"COUNTIF(Data!R:R,W21)","v":0},{"$f":"SUMIFS(Data!DI:DI,Data!R:R,MOVEMENT!W21)","v":0},{"$f":"SUMIFS(Data!DK:DK,Data!R:R,MOVEMENT!W21)","v":0}]
[null,null,null,null,null,null,null,null,null,null,null,null,null,null,null,null,null,null,null,null,null,null,"Machanbaw",{"$f":"COUNTIF(Data!R:R,W22)","v":0},{"$f":"SUMIFS(Data!DI:DI,Data!R:R,MOVEMENT!W22)","v":0},{"$f":"SUMIFS(Data!DK:DK,Data!R:R,MOVEMENT!W22)","v":0}]
[null,null,null,null,null,null,null,null,null,null,null,null,null,null,null,null,null,null,null,null,null,null,"Hpakant",{"$f":"COUNTIF(Data!R:R,W23)","v":22},{"$f":"SUMIFS(Data!DI:DI,Data!R:R,MOVEMENT!W23)","v":1111},{"$f":"SUMIFS(Data!DK:DK,Data!R:R,MOVEMENT!W23)","v":501}]
[null,null,null,null,null,null,null,null,null,null,null,null,null,null,null,null,null,null,null,null,null,null,"TOTALS",{"$f":"SUM(X6:X23)","v":110},{"$f":"SUM(Y6:Y23)","v":2154},{"$f":"SUM(Z6:Z23)","v":866}]
[null,null,null,null,null,null,null,null,null,null,null,null,null,null,null,null,null,null,null,null,null,"Shan (North)","Namphan",{"$f":"COUNTIF(Data!R:R,W25)","v":0},{"$f":"SUMIFS(Data!DI:DI,Data!R:R,MOVEMENT!W25)","v":0},{"$f":"SUMIFS(Data!DK:DK,Data!R:R,MOVEMENT!W25)","v":0}]
[null,null,null,null,null,null,null,null,null,null,null,null,null,null,null,null,null,null,null,null,null,null,"Nawnghkio",{"$f":"COUNTIF(Data!R:R,W26)","v":0},{"$f":"SUMIFS(Data!DI:DI,Data!R:R,MOVEMENT!W26)","v":0},{"$f":"SUMIFS(Data!DK:DK,Data!R:R,MOVEMENT!W26)","v":0}]
[null,null,null,null,null,null,null,null,null,null,null,null,null,null,null,null,null,null,null,null,null,null,"Mongyai",{"$f":"COUNTIF(Data!R:R,W27)","v":0},{"$f":"SUMIFS(Data!DI:DI,Data!R:R,MOVEMENT!W27)","v":0},{"$f":"SUMIFS(Data!DK:DK,Data!R:R,MOVEMENT!W27)","v":0}]
[null,null,null,null,null,null,null,null,null,null,null,null,null,null,null,null,null,null,null,null,null,null,"Namhsan",{"$f":"COUNTIF(Data!R:R,W28)","v":0},{"$f":"SUMIFS(Data!DI:DI,Data!R:R,MOVEMENT!W28)","v":0},{"$f":"SUMIFS(Data!DK:DK,Data!R:R,MOVEMENT!W28)","v":0}]
[null,null,null,null,null,null,null,null,null,null,null,null,null,null,null,null,null,null,null,null,null,null,"Hseni",{"$f":"COUNTIF(Data!R:R,W29)","v":1},{"$f":"SUMIFS(Data!DI:DI,Data!R:R,MOVEMENT!W29)","v":55},{"$f":"SUMIFS(Data!DK:DK,Data!R:R,MOVEMENT!W29)","v":1}]
[null,null,null,null,null,null,null,null,null,null,null,null,null,null,null,null,null,null,null,null,null,null,"Laukkaing",{"$f":"COUNTIF(Data!R:R,W30)","v":0},{"$f":"SUMIFS(Data!DI:DI,Data!R:R,MOVEMENT!W30)","v":0},{"$f":"SUMIFS(Data!DK:DK,Data!R:R,MOVEMENT!W30)","v":0}]
[null,null,null,null,null,null,null,null,null,null,null,null,null,null,null,null,null,null,null,null,null,null,"Muse",{"$f":"COUNTIF(Data!R:R,W31)","v":1},{"$f":"SUMIFS(Data!DI:DI,Data!R:R,MOVEMENT!W31)","v":0},{"$f":"SUMIFS(Data!DK:DK,Data!R:R,MOVEMENT!W31)","v":0}]
[null,null,null,null,null,null,null,null,null,null,null,null,null,null,null,null,null,null,null,null,null,null,"Mabein",{"$f":"COUNTIF(Data!R:R,W32)","v":0},{"$f":"SUMIFS(Data!DI:DI,Data!R:R,MOVEMENT!W32)","v":0},{"$f":"SUMIFS(Data!DK:DK,Data!R:R,MOVEMENT!W32)","v":0}]
[null,null,null,null,null,null,null,null,null,null,null,null,null,null,null,null,null,null,null,null,null,null,"Kyaukme",{"$f":"COUNTIF(Data!R:R,W33)","v":0},{"$f":"SUMIFS(Data!DI:DI,Data!R:R,MOVEMENT!W33)","v":0},{"$f":"SUMIFS(Data!DK:DK,Data!R:R,MOVEMENT!W33)","v":0}]
[null,null,null,null,null,null,null,null,null,null,null,null,null,null,null,null,null,null,null,null,null,null,"Lashio",{"$f":"COUNTIF(Data!R:R,W34)","v":0},{"$f":"SUMIFS(Data!DI:DI,Data!R:R,MOVEMENT!W34)","v":0},{"$f":"SUMIFS(Data!DK:DK,Data!R:R,MOVEMENT!W34)","v":0}]
[null,null,null,null,null,null,null,null,null,null,null,null,null,null,null,null,null,null,null,null,null,null,"Kunlong",{"$f":"COUNTIF(Data!R:R,W35)","v":0},{"$f":"SUMIFS(Data!DI:DI,Data!R:R,MOVEMENT!W35)","v":0},{"$f":"SUMIFS(Data!DK:DK,Data!R:R,MOVEMENT!W35)","v":0}]
[null,null,null,null,null,null,null,null,null,null,null,null,null,null,null,null,null,null,null,null,null,null,"Matman",{"$f":"COUNTIF(Data!R:R,W36)","v":0},{"$f":"SUMIFS(Data!DI:DI,Data!R:R,MOVEMENT!W36)","v":0},{"$f":"SUMIFS(Data!DK:DK,Data!R:R,MOVEMENT!W36)","v":0}]
[null,null,null,null,null,null,null,null,null,null,null,null,null,null,null,null,null,null,null,null,null,null,"Namtu",{"$f":"COUNTIF(Data!R:R,W37)","v":1},{"$f":"SUMIFS(Data!DI:DI,Data!R:R,MOVEMENT!W37)","v":1},{"$f":"SUMIFS(Data!DK:DK,Data!R:R,MOVEMENT!W37)","v":1}]
[null,null,null,null,null,null,null,null,null,null,null,null,null,null,null,null,null,null,null,null,null,null,"Mongmit",{"$f":"COUNTIF(Data!R:R,W38)","v":0},{"$f":"SUMIFS(Data!DI:DI,Data!R:R,MOVEMENT!W38)","v":0},{"$f":"SUMIFS(Data!DK:DK,Data!R:R,MOVEMENT!W38)","v":0}]
[null,null,null,null,null,null,null,null,null,null,null,null,null,null,null,null,null,null,null,null,null,null,"Kutkai",{"$f":"COUNTIF(Data!R:R,W39)","v":8},{"$f":"SUMIFS(Data!DI:DI,Data!R:R,MOVEMENT!W39)","v":251},{"$f":"SUMIFS(Data!DK:DK,Data!R:R,MOVEMENT!W39)","v":112}]
[null,null,null,null,null,null,null,null,null,null,null,null,null,null,null,null,null,null,null,null,null,null,"Hsipaw",{"$f":"COUNTIF(Data!R:R,W40)","v":0},{"$f":"SUMIFS(Data!DI:DI,Data!R:R,MOVEMENT!W40)","v":0},{"$f":"SUMIFS(Data!DK:DK,Data!R:R,MOVEMENT!W40)","v":0}]
[null,null,null,null,null,null,null,null,null,null,null,null,null,null,null,null,null,null,null,null,null,null,"Pangsang",{"$f":"COUNTIF(Data!R:R,W41)","v":0},{"$f":"SUMIFS(Data!DI:DI,Data!R:R,MOVEMENT!W41)","v":0},{"$f":"SUMIFS(Data!DK:DK,Data!R:R,MOVEMENT!W41)","v":0}]
[null,null,null,null,null,null,null,null,null,null,null,null,null,null,null,null,null,null,null,null,null,null,"Pangwaun",{"$f":"COUNTIF(Data!R:R,W42)","v":0},{"$f":"SUMIFS(Data!DI:DI,Data!R:R,MOVEMENT!W42)","v":0},{"$f":"SUMIFS(Data!DK:DK,Data!R:R,MOVEMENT!W42)","v":0}]
[null,null,null,null,null,null,null,null,null,null,null,null,null,null,null,null,null,null,null,null,null,null,"Hopang",{"$f":"COUNTIF(Data!R:R,W43)","v":0},{"$f":"SUMIFS(Data!DI:DI,Data!R:R,MOVEMENT!W43)","v":0},{"$f":"SUMIFS(Data!DK:DK,Data!R:R,MOVEMENT!W43)","v":0}]
[null,null,null,null,null,null,null,null,null,null,null,null,null,null,null,null,null,null,null,null,null,null,"Manton",{"$f":"COUNTIF(Data!R:R,W44)","v":1},{"$f":"SUMIFS(Data!DI:DI,Data!R:R,MOVEMENT!W44)","v":3},{"$f":"SUMIFS(Data!DK:DK,Data!R:R,MOVEMENT!W44)","v":0}]
[null,null,null,null,null,null,null,null,null,null,null,null,null,null,null,null,null,null,null,null,null,null,"Konkyan",{"$f":"COUNTIF(Data!R:R,W45)","v":0},{"$f":"SUMIFS(Data!DI:DI,Data!R:R,MOVEMENT!W45)","v":0},{"$f":"SUMIFS(Data!DK:DK,Data!R:R,MOVEMENT!W45)","v":0}]
[null,null,null,null,null,null,null,null,null,null,null,null,null,null,null,null,null,null,null,null,null,null,"Tangyan",{"$f":"COUNTIF(Data!R:R,W46)","v":0},{"$f":"SUMIFS(Data!DI:DI,Data!R:R,MOVEMENT!W46)","v":0},{"$f":"SUMIFS(Data!DK:DK,Data!R:R,MOVEMENT!W46)","v":0}]
[null,null,null,null,null,null,null,null,null,null,null,null,null,null,null,null,null,null,null,null,null,null,"Namhkan",{"$f":"COUNTIF(Data!R:R,W47)","v":4},{"$f":"SUMIFS(Data!DI:DI,Data!R:R,MOVEMENT!W47)","v":2},{"$f":"SUMIFS(Data!DK:DK,Data!R:R,MOVEMENT!W47)","v":54}]
[null,null,null,null,null,null,null,null,null,null,null,null,null,null,null,null,null,null,null,null,null,null,"Mongmao",{"$f":"COUNTIF(Data!R:R,W48)","v":0},{"$f":"SUMIFS(Data!DI:DI,Data!R:R,MOVEMENT!W48)","v":0},{"$f":"SUMIFS(Data!DK:DK,Data!R:R,MOVEMENT!W48)","v":0}]
[null,null,null,null,null,null,null,null,null,null,null,null,null,null,null,null,null,null,null,null,null,null,"TOTALS",{"$f":"SUM(X25:X48)","v":16},{"$f":"SUM(Y25:Y48)","v":312},{"$f":"SUM(Z25:Z48)","v":168}]
[null,null,null,null,null,null,null,null,null,null,null,null,null,null,null,null,null,null,null,null,null,"OVERALL TOTALS",null,{"$f":"X49+X24","v":126},{"$f":"Y49+Y24","v":2466},{"$f":"Z49+Z24","v":1034}]

{"sheet":"Priority Needs","index":20,"n_rows":55,"n_cols":28,"rows_kept":55,"cut":false,"hidden":false,"merged":[]}
[]
[]
[]
[null,null,null,null,null,null,null,null,null,null,null,null,null,null,null,null,null,null,null,null,null,"CAMP MANAGERS PRIORITY NEEDS "]
[null,null,null,null,null,null,null,null,null,null,null,null,null,null,null,null,null,null,null,null,null,null,"Need 1","Need 2","Need 3","Total"]
[null,null,null,null,null,null,null,null,null,null,null,null,null,null,null,null,null,null,null,null,null,"Basic Food                                       ",{"$f":"COUNTIF(Data!FR:FR,V6)","v":27},{"$f":"COUNTIF(Data!FS:FS,V6)","v":15},{"$f":"COUNTIF(Data!FT:FT,V6)","v":3},{"$f":"SUM(W6:Y6)","v":45},null,"Basic Food"]
[null,null,null,null,null,null,null,null,null,null,null,null,null,null,null,null,null,null,null,null,null,"Complementary Food                                 ",{"$f":"COUNTIF(Data!FR:FR,V7)","v":11},{"$f":"COUNTIF(Data!FS:FS,V7)","v":7},{"$f":"COUNTIF(Data!FT:FT,V7)","v":6},{"$f":"SUM(W7:Y7)","v":24},null,"Complementary Food"]
[null,null,null,null,null,null,null,null,null,null,null,null,null,null,null,null,null,null,null,null,null,"Firewood / fuel                                                                      ",{"$f":"COUNTIF(Data!FR:FR,V8)","v":13},{"$f":"COUNTIF(Data!FS:FS,V8)","v":10},{"$f":"COUNTIF(Data!FT:FT,V8)","v":17},40,null,"Firewood / fuel"]
[null,null,null,null,null,null,null,null,null,null,null,null,null,null,null,null,null,null,null,null,null,"Individual shelter/houses             ",{"$f":"COUNTIF(Data!FR:FR,V9)","v":5},{"$f":"COUNTIF(Data!FS:FS,V9)","v":4},{"$f":"COUNTIF(Data!FT:FT,V9)","v":5},14,null,"Individual shelter/houses"]
[null,null,null,null,null,null,null,null,null,null,null,null,null,null,null,null,null,null,null,null,null,"Communal building                      ",{"$f":"COUNTIF(Data!FR:FR,V10)","v":1},{"$f":"COUNTIF(Data!FS:FS,V10)","v":1},{"$f":"COUNTIF(Data!FT:FT,V10)","v":2},4,null,"Communal building"]
[null,null,null,null,null,null,null,null,null,null,null,null,null,null,null,null,null,null,null,null,null,"Partitions within shelters",{"$f":"COUNTIF(Data!FR:FR,V11)","v":0},{"$f":"COUNTIF(Data!FS:FS,V11)","v":2},{"$f":"COUNTIF(Data!FT:FT,V11)","v":2},4,null,"Partitions within shelters"]
[null,null,null,null,null,null,null,null,null,null,null,null,null,null,null,null,null,null,null,null,null,"Blankets/Winter Clothing                                         ",{"$f":"COUNTIF(Data!FR:FR,V12)","v":1},{"$f":"COUNTIF(Data!FS:FS,V12)","v":2},{"$f":"COUNTIF(Data!FT:FT,V12)","v":1},4,null,"Blankets/Winter Clothing"]
[null,null,null,null,null,null,null,null,null,null,null,null,null,null,null,null,null,null,null,null,null,"Hygiene kits                                         ",{"$f":"COUNTIF(Data!FR:FR,V13)","v":1},{"$f":"COUNTIF(Data!FS:FS,V13)","v":1},{"$f":"COUNTIF(Data!FT:FT,V13)","v":1},3,null,"Hygiene kits"]
[null,null,null,null,null,null,null,null,null,null,null,null,null,null,null,null,null,null,null,null,null,"Kitchen sets                                         ",{"$f":"COUNTIF(Data!FR:FR,V14)","v":2},{"$f":"COUNTIF(Data!FS:FS,V14)","v":5},{"$f":"COUNTIF(Data!FT:FT,V14)","v":1},8,null,"Kitchen sets"]
[null,null,null,null,null,null,null,null,null,null,null,null,null,null,null,null,null,null,null,null,null,"Women NFIs (sanitary pads, underwear, etc.)",{"$f":"COUNTIF(Data!FR:FR,V15)","v":0},{"$f":"COUNTIF(Data!FS:FS,V15)","v":1},{"$f":"COUNTIF(Data!FT:FT,V15)","v":0},1,null,"Women NFIs (sanitary pads, underwear, etc.)"]
[null,null,null,null,null,null,null,null,null,null,null,null,null,null,null,null,null,null,null,null,null,"Health facility / Clinic                                         ",{"$f":"COUNTIF(Data!FR:FR,V16)","v":1},{"$f":"COUNTIF(Data!FS:FS,V16)","v":2},{"$f":"COUNTIF(Data!FT:FT,V16)","v":3},6,null,"Health facility / Clinic"]
[null,null,null,null,null,null,null,null,null,null,null,null,null,null,null,null,null,null,null,null,null,"Medicines",{"$f":"COUNTIF(Data!FR:FR,V17)","v":5},{"$f":"COUNTIF(Data!FS:FS,V17)","v":3},{"$f":"COUNTIF(Data!FT:FT,V17)","v":7},15,null,"Medicines"]
[null,null,null,null,null,null,null,null,null,null,null,null,null,null,null,null,null,null,null,null,null,"Medical staff (doctor, nurse, etc)",{"$f":"COUNTIF(Data!FR:FR,V18)","v":4},{"$f":"COUNTIF(Data!FS:FS,V18)","v":2},{"$f":"COUNTIF(Data!FT:FT,V18)","v":2},8,null,"Medical staff (doctor, nurse, etc)"]
[null,null,null,null,null,null,null,null,null,null,null,null,null,null,null,null,null,null,null,null,null,"School facilities",{"$f":"COUNTIF(Data!FR:FR,V19)","v":2},{"$f":"COUNTIF(Data!FS:FS,V19)","v":0},{"$f":"COUNTIF(Data!FT:FT,V19)","v":5},7,null,"School facilities"]
[null,null,null,null,null,null,null,null,null,null,null,null,null,null,null,null,null,null,null,null,null,"School materials / supplies                                         ",{"$f":"COUNTIF(Data!FR:FR,V20)","v":4},{"$f":"COUNTIF(Data!FS:FS,V20)","v":6},{"$f":"COUNTIF(Data!FT:FT,V20)","v":9},19,null,"School materials / supplies"]
[null,null,null,null,null,null,null,null,null,null,null,null,null,null,null,null,null,null,null,null,null,"Transport to school                     ",{"$f":"COUNTIF(Data!FR:FR,V21)","v":2},{"$f":"COUNTIF(Data!FS:FS,V21)","v":1},{"$f":"COUNTIF(Data!FT:FT,V21)","v":4},7,null,"Transport to school"]
[null,null,null,null,null,null,null,null,null,null,null,null,null,null,null,null,null,null,null,null,null,"Well / water tank                          ",{"$f":"COUNTIF(Data!FR:FR,V22)","v":9},{"$f":"COUNTIF(Data!FS:FS,V22)","v":5},{"$f":"COUNTIF(Data!FT:FT,V22)","v":9},23,null,"Well / water tank"]
[null,null,null,null,null,null,null,null,null,null,null,null,null,null,null,null,null,null,null,null,null,"Bathing spaces                                      ",{"$f":"COUNTIF(Data!FR:FR,V23)","v":2},{"$f":"COUNTIF(Data!FS:FS,V23)","v":2},{"$f":"COUNTIF(Data!FT:FT,V23)","v":1},5,null,"Bathing spaces"]
[null,null,null,null,null,null,null,null,null,null,null,null,null,null,null,null,null,null,null,null,null,"Latrines/toilets                                      ",{"$f":"COUNTIF(Data!FR:FR,V24)","v":3},{"$f":"COUNTIF(Data!FS:FS,V24)","v":2},{"$f":"COUNTIF(Data!FT:FT,V24)","v":1},6,null,"Latrines/toilets"]
[null,null,null,null,null,null,null,null,null,null,null,null,null,null,null,null,null,null,null,null,null,"Access to job opportunities        ",{"$f":"COUNTIF(Data!FR:FR,V25)","v":3},{"$f":"COUNTIF(Data!FS:FS,V25)","v":5},{"$f":"COUNTIF(Data!FT:FT,V25)","v":12},20,null,"Access to job opportunities"]
[null,null,null,null,null,null,null,null,null,null,null,null,null,null,null,null,null,null,null,null,null,"Cash/money assistance",{"$f":"COUNTIF(Data!FR:FR,V26)","v":15},{"$f":"COUNTIF(Data!FS:FS,V26)","v":31},{"$f":"COUNTIF(Data!FT:FT,V26)","v":13},59,null,"Cash/money assistance"]
[null,null,null,null,null,null,null,null,null,null,null,null,null,null,null,null,null,null,null,null,null,"Vocational training                       ",{"$f":"COUNTIF(Data!FR:FR,V27)","v":2},{"$f":"COUNTIF(Data!FS:FS,V27)","v":3},{"$f":"COUNTIF(Data!FT:FT,V27)","v":7},12,null,"Vocational training"]
[null,null,null,null,null,null,null,null,null,null,null,null,null,null,null,null,null,null,null,null,null,"Other",{"$f":"COUNTIF(Data!FR:FR,V28)","v":6},{"$f":"COUNTIF(Data!FS:FS,V28)","v":5},{"$f":"COUNTIF(Data!FT:FT,V28)","v":6},17,null,"Other"]
[]
[]
[null,null,null,null,null,null,null,null,null,null,null,null,null,null,null,null,null,null,null,null,null,"CAMP RESIDENTS PRIORITY NEEDS "]
[null,null,null,null,null,null,null,null,null,null,null,null,null,null,null,null,null,null,null,null,null,null,"Need 1","Need 2","Need 3","Total"]
[null,null,null,null,null,null,null,null,null,null,null,null,null,null,null,null,null,null,null,null,null,"Basic Food                                       ",{"$f":"COUNTIF(Data!FU:FU,V33)","v":3},{"$f":"COUNTIF(Data!FV:FV,V33)","v":0},{"$f":"COUNTIF(Data!FW:FW,V33)","v":3},{"$f":"SUM(W33:Y33)","v":6}]
[null,null,null,null,null,null,null,null,null,null,null,null,null,null,null,null,null,null,null,null,null,"Complementary Food                                 ",{"$f":"COUNTIF(Data!FU:FU,V34)","v":8},{"$f":"COUNTIF(Data!FV:FV,V34)","v":6},{"$f":"COUNTIF(Data!FW:FW,V34)","v":3},{"$f":"SUM(W34:Y34)","v":17}]
[null,null,null,null,null,null,null,null,null,null,null,null,null,null,null,null,null,null,null,null,null,"Firewood / fuel                                                                      ",{"$f":"COUNTIF(Data!FU:FU,V35)","v":8},{"$f":"COUNTIF(Data!FV:FV,V35)","v":6},{"$f":"COUNTIF(Data!FW:FW,V35)","v":7},21]
[null,null,null,null,null,null,null,null,null,null,null,null,null,null,null,null,null,null,null,null,null,"Individual shelter/houses             ",{"$f":"COUNTIF(Data!FU:FU,V36)","v":2},{"$f":"COUNTIF(Data!FV:FV,V36)","v":6},{"$f":"COUNTIF(Data!FW:FW,V36)","v":1},9]
[null,null,null,null,null,null,null,null,null,null,null,null,null,null,null,null,null,null,null,null,null,"Communal building                      ",{"$f":"COUNTIF(Data!FU:FU,V37)","v":2},{"$f":"COUNTIF(Data!FV:FV,V37)","v":3},{"$f":"COUNTIF(Data!FW:FW,V37)","v":1},6]
[null,null,null,null,null,null,null,null,null,null,null,null,null,null,null,null,null,null,null,null,null,"Partitions within shelters",{"$f":"COUNTIF(Data!FU:FU,V38)","v":0},{"$f":"COUNTIF(Data!FV:FV,V38)","v":3},{"$f":"COUNTIF(Data!FW:FW,V38)","v":0},3]
[null,null,null,null,null,null,null,null,null,null,null,null,null,null,null,null,null,null,null,null,null,"Blankets/Winter Clothing                                         ",{"$f":"COUNTIF(Data!FU:FU,V39)","v":2},{"$f":"COUNTIF(Data!FV:FV,V39)","v":1},{"$f":"COUNTIF(Data!FW:FW,V39)","v":5},8]
[null,null,null,null,null,null,null,null,null,null,null,null,null,null,null,null,null,null,null,null,null,"Hygiene kits                                         ",{"$f":"COUNTIF(Data!FU:FU,V40)","v":8},{"$f":"COUNTIF(Data!FV:FV,V40)","v":3},{"$f":"COUNTIF(Data!FW:FW,V40)","v":6},17]
[null,null,null,null,null,null,null,null,null,null,null,null,null,null,null,null,null,null,null,null,null,"Kitchen sets                                         ",{"$f":"COUNTIF(Data!FU:FU,V41)","v":4},{"$f":"COUNTIF(Data!FV:FV,V41)","v":3},{"$f":"COUNTIF(Data!FW:FW,V41)","v":5},12]
[null,null,null,null,null,null,null,null,null,null,null,null,null,null,null,null,null,null,null,null,null,"Women NFIs (sanitary pads, underwear, etc.)",{"$f":"COUNTIF(Data!FU:FU,V42)","v":4},{"$f":"COUNTIF(Data!FV:FV,V42)","v":0},{"$f":"COUNTIF(Data!FW:FW,V42)","v":2},6]
[null,null,null,null,null,null,null,null,null,null,null,null,null,null,null,null,null,null,null,null,null,"Health facility / Clinic                                         ",{"$f":"COUNTIF(Data!FU:FU,V43)","v":3},{"$f":"COUNTIF(Data!FV:FV,V43)","v":3},{"$f":"COUNTIF(Data!FW:FW,V43)","v":2},8]
[null,null,null,null,null,null,null,null,null,null,null,null,null,null,null,null,null,null,null,null,null,"Medicines",{"$f":"COUNTIF(Data!FU:FU,V44)","v":6},{"$f":"COUNTIF(Data!FV:FV,V44)","v":8},{"$f":"COUNTIF(Data!FW:FW,V44)","v":11},25]
[null,null,null,null,null,null,null,null,null,null,null,null,null,null,null,null,null,null,null,null,null,"Medical staff (doctor, nurse, etc)",{"$f":"COUNTIF(Data!FU:FU,V45)","v":1},{"$f":"COUNTIF(Data!FV:FV,V45)","v":1},{"$f":"COUNTIF(Data!FW:FW,V45)","v":1},3]
[null,null,null,null,null,null,null,null,null,null,null,null,null,null,null,null,null,null,null,null,null,"School facilities",{"$f":"COUNTIF(Data!FU:FU,V46)","v":1},{"$f":"COUNTIF(Data!FV:FV,V46)","v":2},{"$f":"COUNTIF(Data!FW:FW,V46)","v":1},4]
[null,null,null,null,null,null,null,null,null,null,null,null,null,null,null,null,null,null,null,null,null,"School materials / supplies                                         ",{"$f":"COUNTIF(Data!FU:FU,V47)","v":7},{"$f":"COUNTIF(Data!FV:FV,V47)","v":5},{"$f":"COUNTIF(Data!FW:FW,V47)","v":0},12]
[null,null,null,null,null,null,null,null,null,null,null,null,null,null,null,null,null,null,null,null,null,"Transport to school                     ",{"$f":"COUNTIF(Data!FU:FU,V48)","v":5},{"$f":"COUNTIF(Data!FV:FV,V48)","v":3},{"$f":"COUNTIF(Data!FW:FW,V48)","v":3},11]
[null,null,null,null,null,null,null,null,null,null,null,null,null,null,null,null,null,null,null,null,null,"Well / water tank                          ",{"$f":"COUNTIF(Data!FU:FU,V49)","v":4},{"$f":"COUNTIF(Data!FV:FV,V49)","v":11},{"$f":"COUNTIF(Data!FW:FW,V49)","v":7},22]
[null,null,null,null,null,null,null,null,null,null,null,null,null,null,null,null,null,null,null,null,null,"Bathing spaces                                      ",{"$f":"COUNTIF(Data!FU:FU,V50)","v":3},{"$f":"COUNTIF(Data!FV:FV,V50)","v":5},{"$f":"COUNTIF(Data!FW:FW,V50)","v":1},9]
[null,null,null,null,null,null,null,null,null,null,null,null,null,null,null,null,null,null,null,null,null,"Latrines/toilets                                      ",{"$f":"COUNTIF(Data!FU:FU,V51)","v":2},{"$f":"COUNTIF(Data!FV:FV,V51)","v":4},{"$f":"COUNTIF(Data!FW:FW,V51)","v":3},9]
[null,null,null,null,null,null,null,null,null,null,null,null,null,null,null,null,null,null,null,null,null,"Access to job opportunities        ",{"$f":"COUNTIF(Data!FU:FU,V52)","v":9},{"$f":"COUNTIF(Data!FV:FV,V52)","v":9},{"$f":"COUNTIF(Data!FW:FW,V52)","v":12},30]
[null,null,null,null,null,null,null,null,null,null,null,null,null,null,null,null,null,null,null,null,null,"Cash/money assistance",{"$f":"COUNTIF(Data!FU:FU,V53)","v":12},{"$f":"COUNTIF(Data!FV:FV,V53)","v":21},{"$f":"COUNTIF(Data!FW:FW,V53)","v":17},50]
[null,null,null,null,null,null,null,null,null,null,null,null,null,null,null,null,null,null,null,null,null,"Vocational training                       ",{"$f":"COUNTIF(Data!FU:FU,V54)","v":14},{"$f":"COUNTIF(Data!FV:FV,V54)","v":10},{"$f":"COUNTIF(Data!FW:FW,V54)","v":11},35]
[null,null,null,null,null,null,null,null,null,null,null,null,null,null,null,null,null,null,null,null,null,"Other",{"$f":"COUNTIF(Data!FU:FU,V55)","v":4},{"$f":"COUNTIF(Data!FV:FV,V55)","v":1},{"$f":"COUNTIF(Data!FW:FW,V55)","v":3},8]

{"sheet":"CCCMShelter","index":21,"n_rows":126,"n_cols":7,"rows_kept":126,"cut":false,"hidden":true,"merged":[[0,0,2,0],[0,1,2,1],[0,2,2,2],[1,3,2,3]]}
["Township","Locations' ID (or) Camps' Code","Standardized Name of IDPs Camps"]
[null,null,null,"Organisation Name"]
[]
["Myitkyina","MMR001CMP001","Tat Kone Baptist Church","KBC, UNHCR",null,"MMR001CMP001",{"$f":"MATCH(B4,F4,0)","v":1}]
["Myitkyina","MMR001CMP002","Njang Dung Baptist Church ","KBC, UNHCR",null,"MMR001CMP002",{"$f":"MATCH(B5,F5,0)","v":1}]
["Myitkyina","MMR001CMP003","Tat Kone Galile Baptist Church","KBC, UNHCR",null,"MMR001CMP003",1]
["Myitkyina    ","MMR001CMP004","Tat Kone Emanuel Church","UNHCR",null,"MMR001CMP004",1]
["Myitkyina","MMR001CMP005","Tat Kone San Pya Baptist Church","KBC, Shalom, UNHCR",null,"MMR001CMP005",1]
["Myitkyina","MMR001CMP006","Shatapru Sut Ngai Tawng","KBC, UNHCR",null,"MMR001CMP006",1]
[null,null,null,null,null,"MMR001CMP007",{"$error":"#N/A"}]
["Myitkyina","MMR001CMP008","Man Hkring Baptist Church","UNHCR",null,"MMR001CMP008",1]
["Myitkyina","MMR001CMP009","Shwe Zet Baptist Church","KBC, UNHCR",null,"MMR001CMP009",1]
["Myitkyina","MMR001CMP010","Du Kahtawng Qtr. 4","KBC, UNHCR",null,"MMR001CMP010",1]
["Myitkyina","MMR001CMP011","Du Kahtawng Qtr. 5","KBC, UNHCR",null,"MMR001CMP011",1]
["Myitkyina","MMR001CMP012","Du Kahtawng Qtr. 14","KBC, UNHCR",null,"MMR001CMP012",1]
["Myitkyina","MMR001CMP013","Kyun Pin Thar Baptist Church","KBC, UNHCR",null,"MMR001CMP013",1]
["Myitkyina","MMR001CMP014","Le Kone Ziun Baptist Church ","KBC, UNHCR",null,"MMR001CMP014",1]
["Myitkyina","MMR001CMP016","Maliyang Baptist Church","UNHCR",null,"MMR001CMP016",1]
[null,null,null,null,null,"MMR001CMP017",{"$error":"#N/A"}]
["Myitkyina","MMR001CMP019","Jan Mai Kawng Catholic Church","KMSS, UNHCR",null,"MMR001CMP019",1]
["Myitkyina","MMR001CMP020","Maw Hpawng Hka Nan Baptist Church","Shalom, UNHCR",null,"MMR001CMP020",1]
["Myitkyina","MMR001CMP021","Maw Hpawng Lhaovo Baptist Church","Shalom, UNHCR",null,"MMR001CMP021",1]
["Myitkyina","MMR001CMP022","Wun Tho Buddhist Monastery","Shalom, UNHCR",null,"MMR001CMP022",1]
["Myitkyina","MMR001CMP023","Tat Kone COC Baptist / Tat Kone Htoi San","Shalom, UNHCR",null,"MMR001CMP023",1]
["Myitkyina","MMR001CMP024","Nan Kway St. John Catholic Church","KMSS, DRC",null,"MMR001CMP024",1]
["Waingmaw","MMR001CMP025","Qtr. 2 Myoma Baptist Church","KBC, UNHCR",null,"MMR001CMP025",1]
["Waingmaw","MMR001CMP026","Qtr. 4 Monestry (Thargaya Thayett Taw)","Shalom, UNHCR",null,"MMR001CMP026",1]
["Waingmaw","MMR001CMP027","Mading Baptist Church","Shalom, UNHCR",null,"MMR001CMP027",1]
["Waingmaw","MMR001CMP028","Hkat Cho ","Shalom, UNHCR, DRC",null,"MMR001CMP028",1]
["Waingmaw","MMR001CMP029","Maina Catholic Church (St. Joseph)","KMSS, UNHCR, DRC",null,"MMR001CMP029",1]
["Waingmaw","MMR001CMP030","Qtr. 3 Mu-yin  Baptist Church","Shalom, UNHCR",null,"MMR001CMP030",1]
["Waingmaw","MMR001CMP031","Maina AG Church","Shalom, UNHCR",null,"MMR001CMP031",1]
["Waingmaw","MMR001CMP032","Qtr. 2 Lhaovo Baptist Church","Shalom, UNHCR, World Vision",null,"MMR001CMP032",1]
["Waingmaw","MMR001CMP036","Waingmaw Baptist Zonal Office","KBC, UNHCR, World Vision",null,"MMR001CMP036",1]
["Waingmaw","MMR001CMP037","Thargaya Lisu Baptist Church","Shalom, UNHCR, World Vision",null,"MMR001CMP037",1]
["Waingmaw","MMR001CMP038","Waingmaw AG Church","Shalom, UNHCR, World Vision",null,"MMR001CMP038",1]
["Waingmaw","MMR001CMP039","Maina Lawang Baptist Church","KBC, UNHCR, World Vision",null,"MMR001CMP039",1]
["Waingmaw","MMR001CMP040","Maina KBC (Bawng Ring)","KBC, UNHCR",null,"MMR001CMP040",1]
[null,null,null,null,null,"MMR001CMP042",{"$error":"#N/A"}]
[null,null,null,null,null,"MMR001CMP043",{"$error":"#N/A"}]
["Bhamo","MMR001CMP047","Robert Church","Shalom, UNHCR, DRC",null,"MMR001CMP047",1]
["Bhamo","MMR001CMP049","Lisu Boarding-House","UNHCR",null,"MMR001CMP049",1]
["Bhamo","MMR001CMP050","AD-2000 Tharthana Compound","KBSS, UNHCR",null,"MMR001CMP050",1]
[null,null,null,null,null,"MMR001CMP051",{"$error":"#N/A"}]
[null,null,null,null,null,"MMR001CMP052",{"$error":"#N/A"}]
[null,null,null,null,null,"MMR001CMP053",{"$error":"#N/A"}]
["Bhamo","MMR001CMP054","Nant Hlaing Church","UNHCR",null,"MMR001CMP054",1]
["Bhamo","MMR001CMP055","Ta Gun Taing Monastery (Shwe Kyi Na)","UNHCR",null,"MMR001CMP055",1]
["Momauk","MMR001CMP056","Momauk Baptist Church","UNHCR",null,"MMR001CMP056",1]
[null,null,null,null,null,"MMR001CMP057",{"$error":"#N/A"}]
[null,null,null,null,null,"MMR001CMP058",{"$error":"#N/A"}]
["Momauk","MMR001CMP059","Ni Thaw Ka Monestry","UNHCR",null,"MMR001CMP059",1]
["Momauk","MMR001CMP062","Man Bung Catholic compound","KBSS, UNHCR",null,"MMR001CMP062",1]
["Mansi","MMR001CMP066","Mansi Baptist Church","UNHCR",null,"MMR001CMP066",1]
[null,null,null,null,null,"MMR001CMP067",{"$error":"#N/A"}]
["Shwegu","MMR001CMP068","Shwe Gu Catholic Church","KBSS, UNHCR",null,"MMR001CMP068",1]
["Momauk","MMR001CMP069","Loi Je Catholic Church","KBSS, UNHCR",null,"MMR001CMP069",1]
["Momauk","MMR001CMP070","Loi Je Lisu Camp","UNHCR",null,"MMR001CMP070",1]
["Momauk","MMR001CMP072","Nyaung Na Pin ","UNHCR",null,"MMR001CMP072",1]
["Momauk","MMR001CMP073","Seng Ja ","UNHCR",null,"MMR001CMP073",1]
["Mogaung","MMR001CMP077","Mang Hawng Baptist Church","KBC, UNHCR",null,"MMR001CMP077",1]
["Mogaung","MMR001CMP078","Kyun Taw Baptist Church ","KBC, UNHCR",null,"MMR001CMP078",1]
["Mogaung","MMR001CMP079","Nat Gyi Kone Baptist Church ","KBC, UNHCR",null,"MMR001CMP079",1]
[null,null,null,null,null,"MMR001CMP081",{"$error":"#N/A"}]
["Hpakan","MMR001CMP082","Nga Pyaw Taw Baptist Nursery School ","Shalom, UNHCR",null,"MMR001CMP082",1]
[null,null,null,null,null,"MMR001CMP091",{"$error":"#N/A"}]
[null,null,null,null,null,"MMR001CMP103",{"$error":"#N/A"}]
["Hpakan","MMR001CMP105","Yumar Baptist Church","Shalom, UNHCR",null,"MMR001CMP105",1]
[null,null,null,null,null,"MMR001CMP109",{"$f":"MATCH(B69,F69,0)","v":{"$error":"#N/A"}}]
["Waingmaw","MMR001CMP111","Zai Awng / Mung Ga Zup","KBC, UNHCR",null,"MMR001CMP111",1]
["Waingmaw","MMR001CMP113","Border Post 8","KMSS, UNHCR",null,"MMR001CMP113",1]
["Waingmaw","MMR001CMP115","Hkau Shau (BP 12)","Shalom, DRC",null,"MMR001CMP115",1]
[null,null,null,null,null,"MMR001CMP116",{"$error":"#N/A"}]
[null,null,null,null,null,"MMR001CMP117",{"$error":"#N/A"}]
["Waingmaw","MMR001CMP119","Maga Yang ","KMSS, DRC",null,"MMR001CMP119",1]
["Waingmaw","MMR001CMP120","Pajau / Jan Mai","KBC, UNHCR",null,"MMR001CMP120",1]
["Momauk","MMR001CMP121","Je Yang Hka ","KBSS, UNHCR, DRC",null,"MMR001CMP121",1]
["Momauk","MMR001CMP122","Hpun Lum Yang ","KMSS, Shalom, DRC",null,"MMR001CMP122",1]
["Momauk","MMR001CMP123","Dum Bung ","KMSS, UNHCR",null,"MMR001CMP123",1]
["Momauk","MMR001CMP126","Pa Kahtawng ","KBSS, UNHCR",null,"MMR001CMP126",1]
["Momauk","MMR001CMP128","Lana Zup Ja ","KBSS, UNHCR",null,"MMR001CMP128",1]
[null,null,null,null,null,"MMR001CMP129",{"$error":"#N/A"}]
[null,null,null,null,null,"MMR001CMP131",{"$error":"#N/A"}]
["Mansi","MMR001CMP132","Man Wing Catholic Church","KBSS, UNHCR",null,"MMR001CMP132",1]
["Mansi","MMR001CMP133","Man Wing Baptist Church","KBC, UNHCR, DRC",null,"MMR001CMP133",1]
[null,null,null,null,null,"MMR001CMP135",{"$error":"#N/A"}]
[null,null,null,null,null,"MMR001CMP139",{"$error":"#N/A"}]
[null,null,null,null,null,"MMR001CMP148",{"$error":"#N/A"}]
["Waingmaw","MMR001CMP160","Post 6 Camp","KMSS, UNHCR",null,"MMR001CMP160",1]
[null,null,null,null,null,"MMR001CMP162",{"$error":"#N/A"}]
[null,null,null,null,null,"MMR001CMP167",{"$error":"#N/A"}]
[null,null,null,null,null,"MMR001CMP168",{"$error":"#N/A"}]
[null,null,null,null,null,"MMR001CMP169",{"$error":"#N/A"}]
[null,null,null,null,null,"MMR001CMP172",{"$error":"#N/A"}]
[null,null,null,null,null,"MMR001CMP174",{"$error":"#N/A"}]
[null,null,null,null,null,"MMR001CMP176",{"$error":"#N/A"}]
[null,null,null,null,null,"MMR001CMP177",{"$error":"#N/A"}]
[null,null,null,null,null,"MMR001CMP179",{"$error":"#N/A"}]
[null,null,null,null,null,"MMR001CMP181",{"$error":"#N/A"}]
[null,null,null,null,null,"MMR001CMP182",{"$error":"#N/A"}]
[null,null,null,null,null,"MMR001CMP183",{"$error":"#N/A"}]
[null,null,null,null,null,"MMR001CMP184",{"$error":"#N/A"}]
[null,null,null,null,null,"MMR001CMP185",{"$error":"#N/A"}]
[null,null,null,null,null,"MMR001CMP190",{"$error":"#N/A"}]
[null,null,null,null,null,"MMR001CMP191",{"$error":"#N/A"}]
[null,null,null,null,null,"MMR001CMP192",{"$error":"#N/A"}]
[null,null,null,null,null,"MMR001CMP194",{"$error":"#N/A"}]
["Chipwi","MMR001CMP195","Lhaovao Baptist Church (LBC)","Shalom, UNHCR, DRC",null,"MMR001CMP195",1]
[null,null,null,null,null,"MMR001CMP202",{"$error":"#N/A"}]
[null,null,null,null,null,"MMR001CMP203",{"$error":"#N/A"}]
[null,null,null,null,null,"MMR001CMP204",{"$error":"#N/A"}]
[null,null,null,null,null,"MMR001CMP207",{"$error":"#N/A"}]
["Namhkan","MMR015CMP001","Nam Hkam (KBC Jaw Wang)","KBC, UNHCR, DRC",null,"MMR015CMP001",1]
[null,null,null,null,null,"MMR015CMP003",{"$error":"#N/A"}]
["Namhkan","MMR015CMP004","Nam Hkam - Nay Win Ni (Palawng)","KBC, UNHCR, DRC",null,"MMR015CMP004",1]
[null,null,null,null,null,"MMR015CMP006",{"$error":"#N/A"}]
["Kutkai","MMR015CMP007","Nam Hpak Ka Mare ","Shalom, DRC",null,"MMR015CMP007",1]
["Manton","MMR015CMP009","Mandung - Jinghpaw","KBC, UNHCR",null,"MMR015CMP009",1]
[null,null,null,null,null,"MMR015CMP012",{"$error":"#N/A"}]
["Namtu","MMR015CMP014","Nam Tu","KBC, UNHCR",null,"MMR015CMP014",1]
[null,null,null,null,null,"MMR015CMP015",{"$error":"#N/A"}]
[null,null,null,null,null,"MMR015CMP016",{"$error":"#N/A"}]
[null,null,null,null,null,"MMR015CMP017",{"$error":"#N/A"}]
[null,null,null,null,null,"MMR015CMP018",{"$error":"#N/A"}]
[null,null,null,null,null,"MMR015CMP019",{"$error":"#N/A"}]
[null,null,null,null,null,"MMR015CMP020",{"$error":"#N/A"}]